{"text_format":"1","workbook":"xlsx","n_sheets":20,"sheets":["Forside","Læsevejledning","Tabel 1","Tabel 2","Tabel 3","Tabel 4","Tabel 5","Tabel 6","Tabel 7","Tabel 8","Tabel 9","Tabel 10","Tabel 11","Tabel 12","Tabel 13","Tabel 14","Tabel 15","Tabel 16","Tabel 17","Tabel 18"],"not_rendered":{"charts":0,"images":2,"macros":1,"external_links":0,"defined_names":4,"comments":0,"pivot_tables":0},"unopened":[],"bounds":{"document_bytes":16777216,"sheet_cells":100000,"rows_first":2000,"rows_last":500,"rows_between":2000,"halvings":0,"cell_chars":16384,"cell_head_chars":4096},"cells_cut":0,"cells_raw":0,"read":"whole","date_system":"1900"}

{"sheet":"Forside","index":0,"n_rows":29,"n_cols":2,"rows_kept":29,"cut":false,"hidden":false,"merged":[]}
[]
["Analyse: Psykiatriske diagnoser og kontakter blandt børn og unge i 2012-2022"]
[]
["Bilag 4: Regionsspecifikke nøgletal"]
[]
[]
[]
[]
[]
["Indhold:"]
["Læsevejledning","Læsevejledning"]
["Tabel 1","Antal børn og unge med psykiatriske diagnoser, 2013-2023"]
["Tabel 2","Antal børn og unge med psykiatriske diagnoser pr. 1.000 0-17-årige, 2013-2023"]
["Tabel 3","Antal børn og unge med udvalgte diagnoser, 2013 og 2023"]
["Tabel 4","Antal børn og unge med udvalgte diagnoser pr. 1.000 0-17-årige, 2013 og 2023"]
["Tabel 5","Antal børn og unge med mere end en psykiatrisk diagnose, 2013 og 2023"]
["Tabel 6","Antal børn og unge i kontakt med det psykiatriske sygehusvæsen ved fysisk fremmøde, 2012-2022"]
["Tabel 7","Antal børn og unge i kontakt med det psykiatriske sygehusvæsen ved fysisk fremmøde pr. 1.000 0-17-årige, 2012-2022"]
["Tabel 8","Antal børn og unge i virtuel kontakt med det psykiatriske sygehusvæsen, 2012-2022"]
["Tabel 9","Antal børn og unge i virtuel kontakt med det psykiatriske sygehusvæsen pr. 1.000 0-17-årige, 2012-2022"]
["Tabel 10","Antal børn og unge i kontakt med det psykiatriske sygehusvæsen ved et udekontakt, 2012-2022"]
["Tabel 11","Antal børn og unge i kontakt med det psykiatriske sygehusvæsen ved et udekontakt pr. 1.000 0-17-årige, 2012-2022"]
["Tabel 12","Antal børn og unge i kontakt med det psykiatriske sygehusvæsen ved enten fysisk fremmø-de, virtuel kontakt eller udekontakt 2012-2022"]
["Tabel 13","Antal børn og unge i kontakt med det psykiatriske sygehusvæsen ved enten fysisk fremmø-de, virtuel kontakt eller udekontakt pr. 1.000 0-17-årige, 2012-2022"]
["Tabel 14","Antal debuterende børn og unge i psykiatrien, 2012-2022"]
["Tabel 15","Antal debuterende børn og unge i psykiatrien pr. 1.000 0-17-årige, 2012-2022"]
["Tabel 16","Antal børn og unge, der er gengangere i psykiatrien, 2012-2022"]
["Tabel 17","Antal børn og unge, der er gengangere i psykiatrien pr. 1.000 0-17-årige, 2012-2022"]
["Tabel 18","Andel børn og unge med debut i psykiatrien, fordelt efter måden den første kontakt starter på og henvisningsaktør, 2020-2022"]

{"sheet":"Læsevejledning","index":1,"n_rows":81,"n_cols":1,"rows_kept":81,"cut":false,"hidden":false,"merged":[]}
[]
["Læsevejledningen"]
[]
["Forsiden"]
[]
[]
["I det følgende præsenteres en række tabeller med regionsspecifikke nøgletal. Generelt er data i nærværende bilag afgrænset på samme måde, som i analysenotatet. Såfremt der er færre end fem personer i en given gruppe i en kommune i Bilag 5: Kommunespecifikke nøgletal”, er værdien for kommunen skjult af diskretionshensyn. For at man ikke skal kunne regne sig frem til de diskretionerede kommuners tal, er antallet for regionerne i indeværende bilag afrundet til nærmeste ti personer. På samme måde er antallet for sundhedsklyngerne og landsplan også afrundet til nærmeste ti personer. Derfor vil summen af regionerne ikke stemme overens summen for hele landet."]
[]
[]
[]
[]
[{"$f":"HYPERLINK(\"#Tabel 1!A1\",(Forside!A12 &\":\"&\"  \"& Forside!B12))","v":"Tabel 1:  Antal børn og unge med psykiatriske diagnoser, 2013-2023"}]
["Tabel 1 viser antal børn og unge med psykiatriske diagnoser i den enkelte region og på landsplan i perioden 2013-2023 opgjort pr. 1. januar i året. Der er tale om børn og unge, der har fået registreret psykiatriske diagnoser på enten psykiatrisk eller somatisk sygehus inden for 10 forudgående år.  "]
[]
[]
[{"$f":"IF(Forside!A13=\"\",\"\",HYPERLINK(\"#Tabel 2!A1\",(Forside!A13&\":\"&\"  \"&Forside!B13)))","v":"Tabel 2:  Antal børn og unge med psykiatriske diagnoser pr. 1.000 0-17-årige, 2013-2023"}]
["Tabel 2 viser antal børn og unge med psykiatriske diagnoser pr. 1.000 0-17-årige i regionen."]
[]
[]
[{"$f":"IF(Forside!A14=\"\",\"\",HYPERLINK(\"#Tabel 3!A1\",(Forside!A14&\":\"&\"  \"&Forside!B14)))","v":"Tabel 3:  Antal børn og unge med udvalgte diagnoser, 2013 og 2023"}]
["Tabel 3 viser antal børn og unge med de fem mest hyppige psykiatriske på landsplan i 2013 og 2023. De fem hyppigste diagnoser er ADHD, autismespektrumforstyrrelser, tilpasnings- og belastningsreaktioner (stress), specifikke udviklingsforstyrrelser og angst (inkl. OCD). Der vises antal i den enkelte region og på landsplan."]
[]
[]
[{"$f":"IF(Forside!A15=\"\",\"\",HYPERLINK(\"#Tabel 4!A1\",(Forside!A15&\":\"&\"  \"&Forside!B15)))","v":"Tabel 4:  Antal børn og unge med udvalgte diagnoser pr. 1.000 0-17-årige, 2013 og 2023"}]
["Tabel 4 viser antal børn og unge med de fem mest hyppige psykiatriske diagnoser på landsplan i 2013 og 2023 opgjort i forhold til 1.000 0-17-årige."]
[]
[]
[{"$f":"IF(Forside!A16=\"\",\"\",HYPERLINK(\"#Tabel 5!A1\",(Forside!A16&\":\"&\"  \"&Forside!B16)))","v":"Tabel 5:  Antal børn og unge med mere end en psykiatrisk diagnose, 2013 og 2023"}]
["Tabel 5 viser antal børn og unge der har mere end én registreret psykiatrisk diagnose inden for 10 forudgående år. Tabellen viser faktisk antal og antallet opgjort pr. 1.000 0-17-årige i regionen og på landsplan."]
[]
[]
[{"$f":"IF(Forside!A17=\"\",\"\",HYPERLINK(\"#Tabel 6!A1\",(Forside!A17&\":\"&\"  \"&Forside!B17)))","v":"Tabel 6:  Antal børn og unge i kontakt med det psykiatriske sygehusvæsen ved fysisk fremmøde, 2012-2022"}]
["Tabel 6 viser antal børn og unge i kontakt med det psykiatriske sygehusvæsen ved fysisk fremmøde på sygehuset i perioden 2012-2022."]
[]
[]
[{"$f":"IF(Forside!A18=\"\",\"\",HYPERLINK(\"#Tabel 7!A1\",(Forside!A18&\":\"&\"  \"&Forside!B18)))","v":"Tabel 7:  Antal børn og unge i kontakt med det psykiatriske sygehusvæsen ved fysisk fremmøde pr. 1.000 0-17-årige, 2012-2022"}]
["Tabel 7 viser antal børn og unge i kontakt med det psykiatriske sygehusvæsen ved fysisk fremmøde på sygehuset i perioden 2012-2022 opgjort pr. 1.000 0-17-årige."]
[]
[]
[{"$f":"IF(Forside!A19=\"\",\"\",HYPERLINK(\"#Tabel 8!A1\",(Forside!A19&\":\"&\"  \"&Forside!B19)))","v":"Tabel 8:  Antal børn og unge i virtuel kontakt med det psykiatriske sygehusvæsen, 2012-2022"}]
["Tabel 8 viser antal børn og unge i virtuel kontakt med det psykiatriske sygehusvæsen i perioden 2012-2022. Virtuelle kontakter er defineret som telefon- og videokonsultationer."]
[]
[]
[{"$f":"IF(Forside!A20=\"\",\"\",HYPERLINK(\"#Tabel 9!A1\",(Forside!A20&\":\"&\"  \"&Forside!B20)))","v":"Tabel 9:  Antal børn og unge i virtuel kontakt med det psykiatriske sygehusvæsen pr. 1.000 0-17-årige, 2012-2022"}]
["Tabel 9 viser antal børn og unge i virtuel kontakt med det psykiatriske sygehusvæsen i perioden 2012-2022 opgjort pr. 1.000 0-17-årige."]
[]
[]
[{"$f":"IF(Forside!A21=\"\",\"\",HYPERLINK(\"#Tabel 10!A1\",(Forside!A21&\":\"&\"  \"&Forside!B21)))","v":"Tabel 10:  Antal børn og unge i kontakt med det psykiatriske sygehusvæsen ved et udekontakt, 2012-2022"}]
["Tabel 10 viser antal børn og unge i kontakt med det psykiatriske sygehusvæsen ved et udekontakt i perioden 2012-2022. Udekontakter er defineret som et hjemmebesøg eller udebesøg, som fx skolebesøg."]
[]
[]
[{"$f":"IF(Forside!A22=\"\",\"\",HYPERLINK(\"#Tabel 10!A1\",(Forside!A22&\":\"&\"  \"&Forside!B22)))","v":"Tabel 11:  Antal børn og unge i kontakt med det psykiatriske sygehusvæsen ved et udekontakt pr. 1.000 0-17-årige, 2012-2022"}]
["Tabel 11 antal børn og unge i kontakt med det psykiatriske sygehusvæsen ved et udekontakt i perioden 2012-2022 opgjort pr. 1.000 0-17-årige."]
[]
[]
[{"$f":"IF(Forside!A23=\"\",\"\",HYPERLINK(\"#Tabel 10!A1\",(Forside!A23&\":\"&\"  \"&Forside!B23)))","v":"Tabel 12:  Antal børn og unge i kontakt med det psykiatriske sygehusvæsen ved enten fysisk fremmø-de, virtuel kontakt eller udekontakt 2012-2022"}]
["Tabel 12 viser antal børn og unge i kontakt med det psykiatriske sygehusvæsen ved enten fysisk fremmøde på sygehuset, virtuel kontakt, eller udekontakt i perioden 2012-2022."]
[]
[]
[{"$f":"IF(Forside!A24=\"\",\"\",HYPERLINK(\"#Tabel 10!A1\",(Forside!A24&\":\"&\"  \"&Forside!B24)))","v":"Tabel 13:  Antal børn og unge i kontakt med det psykiatriske sygehusvæsen ved enten fysisk fremmø-de, virtuel kontakt eller udekontakt pr. 1.000 0-17-årige, 2012-2022"}]
["Tabel 13 viser antal børn og unge i kontakt med det psykiatriske sygehusvæsen ved enten fysisk fremmøde på sygehuset, virtuel kontakt, eller udekontakt i perioden 2012-2022 opgjort pr. 1.000 0-17-årige."]
[]
[]
[{"$f":"IF(Forside!A25=\"\",\"\",HYPERLINK(\"#Tabel 10!A1\",(Forside!A25&\":\"&\"  \"&Forside!B25)))","v":"Tabel 14:  Antal debuterende børn og unge i psykiatrien, 2012-2022"}]
["I tabel 14 ses antal børn og unge der er debuterende i psykiatrien. Debuterende er defineret som børn og unge med første psykiatriske kontakt. Opgørelsen er baseret på kontakter med fysisk fremmøde på sygehuset."]
[]
[]
[{"$f":"IF(Forside!A26=\"\",\"\",HYPERLINK(\"#Tabel 10!A1\",(Forside!A26&\":\"&\"  \"&Forside!B26)))","v":"Tabel 15:  Antal debuterende børn og unge i psykiatrien pr. 1.000 0-17-årige, 2012-2022"}]
["I tabel 15 ses antal børn og unge der er debuterende i psykiatrien opgjort pr. 1.000 0-17-årige."]
[]
[]
[{"$f":"IF(Forside!A27=\"\",\"\",HYPERLINK(\"#Tabel 10!A1\",(Forside!A27&\":\"&\"  \"&Forside!B27)))","v":"Tabel 16:  Antal børn og unge, der er gengangere i psykiatrien, 2012-2022"}]
["I tabel 16 ses antal børn og unge der er gengangere i psykiatrien. Gengangere er defineret som børn og unge, der også på et tidligere tidspunkt har haft en eller flere psykiatriske kontakter. Opgørelsen er baseret på kontakter med fysisk fremmøde på sygehuset."]
[]
[]
[{"$f":"IF(Forside!A28=\"\",\"\",HYPERLINK(\"#Tabel 10!A1\",(Forside!A28&\":\"&\"  \"&Forside!B28)))","v":"Tabel 17:  Antal børn og unge, der er gengangere i psykiatrien pr. 1.000 0-17-årige, 2012-2022"}]
["I tabel 17 ses antal børn og unge der er gengangere i psykiatrien opgjort pr. 1.000 0-17-årige."]
[]
[]
[{"$f":"IF(Forside!A29=\"\",\"\",HYPERLINK(\"#Tabel 10!A1\",(Forside!A29&\":\"&\"  \"&Forside!B29)))","v":"Tabel 18:  Andel børn og unge med debut i psykiatrien, fordelt efter måden den første kontakt starter på og henvisningsaktør, 2020-2022"}]
["Tabel 18 viser andel børn og unge med debut i psykiatrien, fordelt efter måden den første kontakt starter på, som enten kan være akut eller planlagt. Derudover viser tabellen andel børn og unge med debut i psykiatrien, fordelt efter henvisningsaktør, som er enten aktører i kommunen (herunder psykologer i Pædagogisk Psykologisk Rådgivning (PPR), sagsbehandlere i socialforvaltningen og sundhedsplejen), læger i praksissektoren (primært almen praktiserende læger og i mindre grad speciallæger) samt andre sygehusafdelinger (herunder akutordningen). For at sikre robuste opgørelser er andele opgjort på baggrund af perioden 2020-2022."]

{"sheet":"Tabel 1","index":2,"n_rows":18,"n_cols":12,"rows_kept":18,"cut":false,"hidden":false,"merged":[[7,0,7,11],[8,0,8,11],[17,0,17,11],[16,0,16,11]]}
[]
[{"$f":"Forside!A12","v":"Tabel 1"},{"$f":"Forside!B12","v":"Antal børn og unge med psykiatriske diagnoser, 2013-2023"}]
[]
["Forsiden"]
[]
[]
[]
["Antal børn og unge med psykiatriske diagnoser, 2013-2023"]
[]
[null,2013,2014,2015,2016,2017,2018,2019,2020,2021,2022,2023]
["Hovedstaden",16130,16460,16950,17630,18130,18390,18510,19320,19510,20550,21690]
["Midtjylland",11400,12160,13020,13700,14320,14900,15260,15950,16510,17240,17210]
["Nordjylland",3640,3910,4190,4260,4550,4990,5230,5650,5620,5820,6220]
["Sjælland",9070,9380,9920,10430,10880,11120,11110,11320,11500,11830,11720]
["Syddanmark",13880,14280,15100,15910,16150,16530,16670,16430,16270,16410,16390]
["Landsplan",54130,56180,59180,61920,64030,65930,66780,68670,69400,71850,73220]
[]
["Kilde: Danmarks Statistik, Sundhedsdatastyrelsen og egne beregninger."]

{"sheet":"Tabel 2","index":3,"n_rows":16,"n_cols":12,"rows_kept":16,"cut":false,"hidden":false,"merged":[[7,0,7,11]]}
[]
[{"$f":"Forside!A13","v":"Tabel 2"},{"$f":"Forside!B13","v":"Antal børn og unge med psykiatriske diagnoser pr. 1.000 0-17-årige, 2013-2023"}]
[]
["Forsiden"]
[]
[]
[]
["Antal børn og unge med psykiatriske diagnoser pr. 1.000 0-17-årige, 2013-2023"]
[]
[null,2013,2014,2015,2016,2017,2018,2019,2020,2021,2022,2023]
["Hovedstaden",45.1,46,47.2,48.9,49.9,50.4,50.6,52.7,53.2,56,58.9]
["Midtjylland",40.700000000000003,43.9,47.4,50,52.3,54.5,56,58.8,60.9,63.7,63.2]
["Nordjylland",30.4,33.1,36,36.9,39.6,43.6,46,50,50.1,52,55.4]
["Sjælland",52.1,54.9,58.8,62,64.8,66.8,67.400000000000006,69.2,70.599999999999994,72.7,72]
["Syddanmark",53.7,56.2,60.1,63.9,65,67.099999999999994,68.3,67.900000000000006,67.7,68.5,68.3]
["Landsplan",45.5,47.7,50.6,53,54.8,56.6,57.6,59.4,60.2,62.4,63.3]

{"sheet":"Tabel 3","index":4,"n_rows":17,"n_cols":11,"rows_kept":17,"cut":false,"hidden":false,"merged":[[7,0,7,10],[10,1,10,5],[10,6,10,10]]}
[]
[{"$f":"Forside!A14","v":"Tabel 3"},{"$f":"Forside!B14","v":"Antal børn og unge med udvalgte diagnoser, 2013 og 2023"}]
[]
["Forsiden"]
[]
[]
[]
["Antal børn og unge med udvalgte psykiatriske diagnoser, 2013 og 2023"]
[]
[null,"ADHD","Autisme","Stress","Udvikl.f.","Angst","ADHD","Autisme","Stress","Udvikl.f.","Angst"]
[null,2013,null,null,null,null,2023]
["Hovedstaden",4650,4220,2450,2120,1890,7640,8530,3590,2070,3210]
["Midtjylland",3800,2440,1600,2840,1190,8060,5630,2950,4100,2000]
["Nordjylland",950,780,630,700,280,3260,1840,1500,1160,540]
["Sjælland",2870,1950,1360,680,970,4170,4710,2580,1200,1520]
["Syddanmark",3000,1840,2860,2370,1510,4110,2940,3270,3020,2250]
["Landsplan",15260,11220,8900,8710,5850,27240,23650,13900,11540,9520]

{"sheet":"Tabel 4","index":5,"n_rows":17,"n_cols":11,"rows_kept":17,"cut":false,"hidden":false,"merged":[[7,0,7,10],[10,1,10,5],[10,6,10,10]]}
[]
[{"$f":"Forside!A15","v":"Tabel 4"},{"$f":"Forside!B15","v":"Antal børn og unge med udvalgte diagnoser pr. 1.000 0-17-årige, 2013 og 2023"}]
[]
["Forsiden"]
[]
[]
[]
["Antal børn og unge med udvalgte psykiatriske diagnoser pr. 1.000 0-17-årige, 2013 og 2023"]
[]
[null,"ADHD","Autisme","Stress","Udvikl.f.","Angst","ADHD","Autisme","Stress","Udvikl.f.","Angst"]
[null,2013,null,null,null,null,2023]
["Hovedstaden",13,11.8,6.8,5.9,5.3,20.7,23.1,9.8000000000000007,5.6,8.6999999999999993]
["Midtjylland",13.6,8.6999999999999993,5.7,10.1,4.3,29.6,20.7,10.8,15,7.3]
["Nordjylland",7.9,6.5,5.3,5.9,2.4,29,16.399999999999999,13.4,10.4,4.8]
["Sjælland",16.5,11.2,7.8,3.9,5.6,25.7,28.9,15.8,7.4,9.3000000000000007]
["Syddanmark",11.6,7.1,11.1,9.1999999999999993,5.9,17.100000000000001,12.2,13.6,12.6,9.4]
["Landsplan",12.8,9.4,7.5,7.3,4.9000000000000004,23.6,20.5,12,10,8.1999999999999993]

{"sheet":"Tabel 5","index":6,"n_rows":16,"n_cols":5,"rows_kept":16,"cut":false,"hidden":false,"merged":[]}
[]
[{"$f":"Forside!A16","v":"Tabel 5"},{"$f":"Forside!B16","v":"Antal børn og unge med mere end en psykiatrisk diagnose, 2013 og 2023"}]
[]
["Forsiden"]
[]
[]
[]
["Antal børn og unge med mere end én psykiatrisk diagnose, 2013 og 2023"]
[]
[null,"Antal i 2013","Antal i 2023","Pr. 1.000 i 2013","Pr. 1000 i 2023"]
["Hovedstaden",5400,8730,15.1,23.7]
["Midtjylland",4250,7890,15.2,28.9]
["Nordjylland",1260,2890,10.5,25.7]
["Sjælland",2680,5140,15.4,31.6]
["Syddanmark",3510,4540,13.6,18.899999999999999]
["Landsplan",17100,29180,14.4,25.2]

{"sheet":"Tabel 6","index":7,"n_rows":16,"n_cols":12,"rows_kept":16,"cut":false,"hidden":false,"merged":[]}
[]
[{"$f":"Forside!A17","v":"Tabel 6"},{"$f":"Forside!B17","v":"Antal børn og unge i kontakt med det psykiatriske sygehusvæsen ved fysisk fremmøde, 2012-2022"}]
[]
["Forsiden"]
[]
[]
[]
["Antal børn og unge i kontakt med det psykiatriske sygehusvæsen ved fysisk fremmøde, 2012-2022"]
[]
[null,2012,2013,2014,2015,2016,2017,2018,2019,2020,2021,2022]
["Hovedstaden",8460,8420,9140,9720,9920,10360,10530,10900,11270,12110,13560]
["Midtjylland",6100,7240,8630,8920,7990,8450,8740,8910,9000,9880,10050]
["Nordjylland",1800,2080,2330,2490,2870,3400,3350,3430,3170,3750,4190]
["Sjælland",5190,5310,5930,6280,6300,6210,6040,6050,5940,6530,6640]
["Syddanmark",7670,7580,8130,8140,8360,8690,8900,8530,8280,8980,9110]
["Landsplan",29220,30620,34150,35550,35440,37100,37560,37810,37660,41250,43530]

{"sheet":"Tabel 7","index":8,"n_rows":16,"n_cols":12,"rows_kept":16,"cut":false,"hidden":false,"merged":[]}
[]
[{"$f":"Forside!A18","v":"Tabel 7"},{"$f":"Forside!B18","v":"Antal børn og unge i kontakt med det psykiatriske sygehusvæsen ved fysisk fremmøde pr. 1.000 0-17-årige, 2012-2022"}]
[]
["Forsiden"]
[]
[]
[]
["Antal børn og unge i kontakt med det psykiatriske sygehusvæsen ved fysisk fremmøde pr. 1.000 0-17-årige, 2012-2022"]
[]
[null,2012,2013,2014,2015,2016,2017,2018,2019,2020,2021,2022]
["Hovedstaden",23.7,23.5,25.5,27,27.5,28.5,28.9,29.8,30.8,33,36.9]
["Midtjylland",21.5,25.9,31.2,32.5,29.2,30.8,32,32.700000000000003,33.200000000000003,36.5,37.1]
["Nordjylland",14.8,17.3,19.8,21.4,24.8,29.5,29.3,30.2,28.1,33.5,37.4]
["Sjælland",29.1,30.5,34.700000000000003,37.200000000000003,37.5,37,36.200000000000003,36.700000000000003,36.299999999999997,40.1,40.799999999999997]
["Syddanmark",29.2,29.3,32,32.4,33.6,35,36.1,34.9,34.200000000000003,37.4,38]
["Landsplan",24.3,25.7,29,30.4,30.4,31.8,32.200000000000003,32.6,32.6,35.799999999999997,37.799999999999997]

{"sheet":"Tabel 8","index":9,"n_rows":16,"n_cols":12,"rows_kept":16,"cut":false,"hidden":false,"merged":[]}
[]
[{"$f":"Forside!A19","v":"Tabel 8"},{"$f":"Forside!B19","v":"Antal børn og unge i virtuel kontakt med det psykiatriske sygehusvæsen, 2012-2022"}]
[]
["Forsiden"]
[]
[]
[]
["Antal børn og unge i virtuel kontakt med det psykiatriske sygehusvæsen, 2012-2022"]
[]
[null,2012,2013,2014,2015,2016,2017,2018,2019,2020,2021,2022]
["Hovedstaden",4210,4040,4590,4610,4550,4560,5110,4860,7380,8360,8660]
["Midtjylland",3500,4050,4390,4030,3890,4260,4560,4770,5970,6020,6210]
["Nordjylland",210,220,250,280,310,390,460,2180,2450,2740,2750]
["Sjælland",1830,1890,2070,2400,2470,2720,3220,2830,4500,5040,5300]
["Syddanmark",3700,3320,3160,3190,3370,3600,3780,4020,5510,5580,5650]
["Landsplan",13440,13520,14460,14510,14580,15530,17130,18660,25810,27730,28560]

{"sheet":"Tabel 9","index":10,"n_rows":16,"n_cols":12,"rows_kept":16,"cut":false,"hidden":false,"merged":[]}
[]
[{"$f":"Forside!A20","v":"Tabel 9"},{"$f":"Forside!B20","v":"Antal børn og unge i virtuel kontakt med det psykiatriske sygehusvæsen pr. 1.000 0-17-årige, 2012-2022"}]
[]
["Forsiden"]
[]
[]
[]
["Antal børn og unge i virtuel kontakt med det psykiatriske sygehusvæsen pr. 1.000 0-17-årige, 2012-2022"]
[]
[null,2012,2013,2014,2015,2016,2017,2018,2019,2020,2021,2022]
["Hovedstaden",11.8,11.3,12.8,12.8,12.6,12.6,14,13.3,20.100000000000001,22.8,23.6]
["Midtjylland",12.4,14.4,15.9,14.7,14.2,15.6,16.7,17.5,22,22.2,22.9]
["Nordjylland",1.7,1.9,2.1,2.4,2.7,3.4,4,19.2,21.7,24.4,24.6]
["Sjælland",10.3,10.9,12.1,14.2,14.7,16.2,19.3,17.2,27.5,31,32.5]
["Syddanmark",14.1,12.9,12.4,12.7,13.5,14.5,15.3,16.5,22.8,23.2,23.6]
["Landsplan",11.2,11.4,12.3,12.4,12.5,13.3,14.7,16.100000000000001,22.3,24.1,24.8]

{"sheet":"Tabel 10","index":11,"n_rows":16,"n_cols":12,"rows_kept":16,"cut":false,"hidden":false,"merged":[]}
[]
[{"$f":"Forside!A21","v":"Tabel 10"},{"$f":"Forside!B21","v":"Antal børn og unge i kontakt med det psykiatriske sygehusvæsen ved et udekontakt, 2012-2022"}]
[]
["Forsiden"]
[]
[]
[]
["Antal børn og unge i kontakt med det psykiatriske sygehusvæsen ved et udekontakt, 2012-2022"]
[]
[null,2012,2013,2014,2015,2016,2017,2018,2019,2020,2021,2022]
["Hovedstaden",950,1030,1250,1320,1310,1110,1230,1060,1110,1130,1630]
["Midtjylland",630,1170,1180,1250,1270,1410,1300,1280,950,800,950]
["Nordjylland",80,80,100,70,90,80,70,80,80,110,90]
["Sjælland",220,270,250,160,160,150,190,430,420,390,390]
["Syddanmark",1190,1130,1140,1110,1170,1270,1300,1200,1210,1050,920]
["Landsplan",3070,3680,3910,3900,4010,4020,4080,4040,3770,3470,3980]

{"sheet":"Tabel 11","index":12,"n_rows":16,"n_cols":12,"rows_kept":16,"cut":false,"hidden":false,"merged":[]}
[]
[{"$f":"Forside!A22","v":"Tabel 11"},{"$f":"Forside!B22","v":"Antal børn og unge i kontakt med det psykiatriske sygehusvæsen ved et udekontakt pr. 1.000 0-17-årige, 2012-2022"}]
[]
["Forsiden"]
[]
[]
[]
["Antal børn og unge i kontakt med det psykiatriske sygehusvæsen ved et udekontakt, pr. 1.000 0-17-årige, 2012-2022"]
[]
[null,2012,2013,2014,2015,2016,2017,2018,2019,2020,2021,2022]
["Hovedstaden",2.7,2.9,3.5,3.7,3.6,3.1,3.4,2.9,3,3.1,4.4000000000000004]
["Midtjylland",2.2000000000000002,4.2,4.2,4.5,4.7,5.0999999999999996,4.7,4.7,3.5,2.9,3.5]
["Nordjylland",0.7,0.6,0.8,0.6,0.8,0.7,0.6,0.7,0.7,0.9,0.8]
["Sjælland",1.2,1.5,1.4,1,1,0.9,1.1000000000000001,2.6,2.6,2.4,2.4]
["Syddanmark",4.5,4.4000000000000004,4.5,4.4000000000000004,4.7,5.0999999999999996,5.3,4.9000000000000004,5,4.3,3.9]
["Landsplan",2.6,3.1,3.3,3.3,3.4,3.4,3.5,3.5,3.3,3,3.5]

{"sheet":"Tabel 12","index":13,"n_rows":16,"n_cols":12,"rows_kept":16,"cut":false,"hidden":false,"merged":[]}
[]
[{"$f":"Forside!A23","v":"Tabel 12"},{"$f":"Forside!B23","v":"Antal børn og unge i kontakt med det psykiatriske sygehusvæsen ved enten fysisk fremmø-de, virtuel kontakt eller udekontakt 2012-2022"}]
[]
["Forsiden"]
[]
[]
[]
["Antal børn og unge i kontakt med det psykiatriske sygehusvæsen ved enten fysisk fremmøde, virtuel kontakt eller udekontakt, 2012-2022"]
[]
[null,2012,2013,2014,2015,2016,2017,2018,2019,2020,2021,2022]
["Hovedstaden",8620,8550,9360,9920,10090,10540,10740,11150,11730,12770,14110]
["Midtjylland",6250,7440,8820,9080,8150,8600,8910,9100,9480,10330,10730]
["Nordjylland",1810,2090,2340,2500,2880,3410,3370,3450,3320,3890,4330]
["Sjælland",5230,5340,5990,6350,6350,6310,6090,6160,6250,6790,6990]
["Syddanmark",7850,7780,8300,8330,8550,8880,9070,8750,8800,9510,9600]
["Landsplan",29760,31200,34800,36170,36020,37730,38170,38610,39580,43290,45760]

{"sheet":"Tabel 13","index":14,"n_rows":16,"n_cols":12,"rows_kept":16,"cut":false,"hidden":false,"merged":[]}
[]
[{"$f":"Forside!A24","v":"Tabel 13"},{"$f":"Forside!B24","v":"Antal børn og unge i kontakt med det psykiatriske sygehusvæsen ved enten fysisk fremmø-de, virtuel kontakt eller udekontakt pr. 1.000 0-17-årige, 2012-2022"}]
[]
["Forsiden"]
[]
[]
[]
["Antal børn og unge i kontakt med det psykiatriske sygehusvæsen ved enten fysisk fremmøde, virtuel kontakt eller udekontakt pr. 1.000 0-17-årige, 2012-2022"]
[]
[null,2012,2013,2014,2015,2016,2017,2018,2019,2020,2021,2022]
["Hovedstaden",24.2,23.9,26.1,27.6,28,29,29.4,30.5,32,34.799999999999997,38.5]
["Midtjylland",22.1,26.6,31.9,33.1,29.8,31.4,32.6,33.4,35,38.1,39.6]
["Nordjylland",14.8,17.399999999999999,19.899999999999999,21.5,24.9,29.6,29.4,30.4,29.4,34.6,38.700000000000003]
["Sjælland",29.4,30.6,35.1,37.700000000000003,37.799999999999997,37.6,36.6,37.299999999999997,38.200000000000003,41.7,42.9]
["Syddanmark",29.9,30.1,32.700000000000003,33.200000000000003,34.299999999999997,35.700000000000003,36.799999999999997,35.9,36.4,39.6,40.1]
["Landsplan",24.7,26.2,29.6,30.9,30.9,32.299999999999997,32.799999999999997,33.299999999999997,34.200000000000003,37.5,39.700000000000003]

{"sheet":"Tabel 14","index":15,"n_rows":16,"n_cols":12,"rows_kept":16,"cut":false,"hidden":false,"merged":[]}
[]
[{"$f":"Forside!A25","v":"Tabel 14"},{"$f":"Forside!B25","v":"Antal debuterende børn og unge i psykiatrien, 2012-2022"}]
[]
["Forsiden"]
[]
[]
[]
["Antal debuterende børn og unge i psykiatrien, 2012-2022"]
[]
[null,2012,2013,2014,2015,2016,2017,2018,2019,2020,2021,2022]
["Hovedstaden",3110,2950,3390,3580,3610,3870,3430,3750,4140,4550,4960]
["Midtjylland",2480,3200,3770,3740,2950,3130,3130,3150,3130,3590,3280]
["Nordjylland",900,1040,1110,1140,1270,1480,1300,1260,1100,1410,1500]
["Sjælland",1840,1830,2110,2200,2050,2020,2010,1940,2020,2280,2220]
["Syddanmark",2990,2950,3390,3210,3210,3370,3210,2960,2990,3410,3180]
["Landsplan ",11330,11960,13770,13860,13080,13860,13080,13060,13380,15240,15130]

{"sheet":"Tabel 15","index":16,"n_rows":16,"n_cols":12,"rows_kept":16,"cut":false,"hidden":false,"merged":[]}
[]
[{"$f":"Forside!A26","v":"Tabel 15"},{"$f":"Forside!B26","v":"Antal debuterende børn og unge i psykiatrien pr. 1.000 0-17-årige, 2012-2022"}]
[]
["Forsiden"]
[]
[]
[]
["Antal debuterende børn og unge i psykiatrien pr. 1.000 0-17-årige, 2012-2022"]
[]
[null,2012,2013,2014,2015,2016,2017,2018,2019,2020,2021,2022]
["Hovedstaden",8.6999999999999993,8.1999999999999993,9.5,10,10,10.7,9.4,10.3,11.3,12.4,13.5]
["Midtjylland",8.6999999999999993,11.4,13.6,13.6,10.8,11.4,11.5,11.6,11.5,13.2,12.1]
["Nordjylland",7.4,8.6999999999999993,9.4,9.8000000000000007,10.9,12.9,11.4,11.1,9.8000000000000007,12.6,13.4]
["Sjælland",10.4,10.5,12.4,13,12.2,12,12.1,11.8,12.3,14,13.6]
["Syddanmark",11.4,11.4,13.3,12.8,12.9,13.6,13,12.1,12.4,14.2,13.3]
["Landsplan ",9.4,10,11.7,11.8,11.2,11.9,11.2,11.3,11.6,13.2,13.1]

{"sheet":"Tabel 16","index":17,"n_rows":16,"n_cols":12,"rows_kept":16,"cut":false,"hidden":false,"merged":[]}
[]
[{"$f":"Forside!A27","v":"Tabel 16"},{"$f":"Forside!B27","v":"Antal børn og unge, der er gengangere i psykiatrien, 2012-2022"}]
[]
["Forsiden"]
[]
[]
[]
["Antal børn og unge der er gengangere i psykiatrien, 2012-2022"]
[]
[null,2012,2013,2014,2015,2016,2017,2018,2019,2020,2021,2022]
["Hovedstaden",5360,5480,5760,6150,6310,6500,7100,7150,7140,7570,8600]
["Midtjylland",3620,4050,4850,5180,5050,5320,5610,5760,5870,6300,6760]
["Nordjylland",900,1040,1230,1350,1610,1920,2050,2170,2070,2340,2690]
["Sjælland",3350,3480,3820,4080,4250,4200,4030,4110,3930,4260,4420]
["Syddanmark",4680,4630,4740,4940,5160,5320,5690,5570,5290,5560,5930]
["Landsplan ",17920,18680,20400,21710,22370,23250,24480,24760,24290,26020,28400]

{"sheet":"Tabel 17","index":18,"n_rows":16,"n_cols":12,"rows_kept":16,"cut":false,"hidden":false,"merged":[]}
[]
[{"$f":"Forside!A28","v":"Tabel 17"},{"$f":"Forside!B28","v":"Antal børn og unge, der er gengangere i psykiatrien pr. 1.000 0-17-årige, 2012-2022"}]
[]
["Forsiden"]
[]
[]
[]
["Antal børn og unge der er gengangere i psykiatrien pr. 1.000 0-17-årige, 2012-2022"]
[]
[null,2012,2013,2014,2015,2016,2017,2018,2019,2020,2021,2022]
["Hovedstaden",15,15.3,16.100000000000001,17.100000000000001,17.5,17.899999999999999,19.5,19.600000000000001,19.5,20.6,23.4]
["Midtjylland",12.8,14.5,17.5,18.899999999999999,18.399999999999999,19.399999999999999,20.5,21.2,21.7,23.2,25]
["Nordjylland",7.4,8.6999999999999993,10.4,11.6,13.9,16.600000000000001,17.899999999999999,19.100000000000001,18.3,20.9,24.1]
["Sjælland",18.8,20,22.3,24.2,25.3,25,24.2,24.9,24,26.1,27.2]
["Syddanmark",17.8,17.899999999999999,18.600000000000001,19.7,20.7,21.4,23.1,22.8,21.9,23.2,24.8]
["Landsplan ",14.9,15.7,17.3,18.600000000000001,19.2,19.899999999999999,21,21.3,21,22.6,24.7]

{"sheet":"Tabel 18","index":19,"n_rows":17,"n_cols":6,"rows_kept":17,"cut":false,"hidden":false,"merged":[[9,1,9,2],[9,3,9,5]]}
[]
[{"$f":"Forside!A29","v":"Tabel 18"},{"$f":"Forside!B29","v":"Andel børn og unge med debut i psykiatrien, fordelt efter måden den første kontakt starter på og henvisningsaktør, 2020-2022"}]
[]
["Forsiden"]
[]
[]
[]
["Andel børn og unge med debut fordelt efter måden kontakten starter på og henvisningsaktør, 2020-2022"]
[]
[null,"Måden kontakten starter på",null,"Henvisningsaktør"]
[null,"Akut","Planlangt","Kommune","Prakt. læge","Sygehusafsnit"]
["Hovedstaden",17.899999999999999,82.1,33,42.9,24.1]
["Midtjylland",8.5,91.5,47.5,38.799999999999997,13.7]
["Nordjylland",12.7,87.3,28.9,48.5,22.6]
["Sjælland",26.3,73.7,40.6,28.6,30.8]
["Syddanmark",9.1999999999999993,90.8,29.5,49,21.5]
["Landsplan ",14.6,85.4,36.299999999999997,41.7,22]