{"text_format":"1","workbook":"xlsx","n_sheets":21,"sheets":["Forside","Læsevejledning","Tabel 1","Tabel 2","Tabel 3","Tabel 4","Tabel 5","Tabel 6","Tabel 7","Tabel 8","Tabel 9","Tabel 10","Tabel 11","Tabel 12","Tabel 13","Tabel 14","Tabel 15","Tabel 16","Tabel 17","Tabel 18","Tabel 19"],"not_rendered":{"charts":0,"images":2,"macros":1,"external_links":0,"defined_names":4,"comments":0,"pivot_tables":0},"unopened":[],"bounds":{"document_bytes":16777216,"sheet_cells":100000,"rows_first":2000,"rows_last":500,"rows_between":2000,"halvings":0,"cell_chars":16384,"cell_head_chars":4096},"cells_cut":0,"cells_raw":0,"read":"whole","date_system":"1900"}

{"sheet":"Forside","index":0,"n_rows":30,"n_cols":2,"rows_kept":30,"cut":false,"hidden":false,"merged":[]}
[]
["Analyse: Psykiatriske diagnoser og kontakter blandt børn og unge i 2012-2022"]
[]
["Bilag 6: Sundhedsklyngespecifikke nøgletal"]
[]
[]
[]
[]
[]
["Indhold:"]
["Læsevejledning","Læsevejledning"]
["Tabel 1","Antal børn og unge med psykiatriske diagnoser, 2013-2023"]
["Tabel 2","Antal børn og unge med psykiatriske diagnoser pr. 1.000 0-17-årige, 2013-2023"]
["Tabel 3","Antal børn og unge med udvalgte diagnoser, 2013 og 2023"]
["Tabel 4","Antal børn og unge med udvalgte diagnoser pr. 1.000 0-17-årige, 2013 og 2023"]
["Tabel 5","Antal børn og unge med mere end en psykiatrisk diagnose, 2013 og 2023"]
["Tabel 6","Antal børn og unge i kontakt med det psykiatriske sygehusvæsen ved fysisk fremmøde, 2012-2022"]
["Tabel 7","Antal børn og unge i kontakt med det psykiatriske sygehusvæsen ved fysisk fremmøde pr. 1.000 0-17-årige, 2012-2022"]
["Tabel 8","Antal børn og unge i virtuel kontakt med det psykiatriske sygehusvæsen, 2012-2022"]
["Tabel 9","Antal børn og unge i virtuel kontakt med det psykiatriske sygehusvæsen pr. 1.000 0-17-årige, 2012-2022"]
["Tabel 10","Antal børn og unge i kontakt med det psykiatriske sygehusvæsen ved et udekontakt, 2012-2022"]
["Tabel 11","Antal børn og unge i kontakt med det psykiatriske sygehusvæsen ved et udekontakt pr. 1.000 0-17-årige, 2012-2022"]
["Tabel 12","Antal børn og unge i kontakt med det psykiatriske sygehusvæsen ved enten fysisk fremmøde, virtuel kontakt eller udekontakt 2012-2022"]
["Tabel 13","Antal børn og unge i kontakt med det psykiatriske sygehusvæsen ved enten fysisk fremmøde, virtuel kontakt eller udekontakt pr. 1.000 0-17-årige, 2012-2022"]
["Tabel 14","Antal debuterende børn og unge i psykiatrien, 2012-2022"]
["Tabel 15","Antal debuterende børn og unge i psykiatrien pr. 1.000 0-17-årige, 2012-2022"]
["Tabel 16","Antal børn og unge, der er gengangere i psykiatrien, 2012-2022"]
["Tabel 17","Antal børn og unge, der er gengangere i psykiatrien pr. 1.000 0-17-årige, 2012-2022"]
["Tabel 18","Andel børn og unge med debut i psykiatrien, fordelt efter måden den første kontakt starter på og henvisningsaktør, 2020-2022"]
["Tabel 19","Andel børn og unge med debut fordelt efter henvisningsaktør i sundhedsklynge og kommune, 2020-2022"]

{"sheet":"Læsevejledning","index":1,"n_rows":85,"n_cols":1,"rows_kept":85,"cut":false,"hidden":false,"merged":[]}
[]
["Læsevejledningen"]
[]
["Forsiden"]
[]
[]
["I det følgende præsenteres en række tabeller med sundhedsklyngespecifikke nøgletal. Generelt er data i nærværende bilag afgrænset på samme måde, som i analysenotatet. Såfremt der er færre end\nfem personer i en given gruppe i en kommune i Bilag 5: Kommunespecifikke nøgletal”, samt i tabel 18 og 19 i dette bilag er værdien for kommunen skjult af diskretionshensyn. For at man ikke skal\nkunne regne sig frem til de diskretionerede kommuners tal, er antallet for sundhedsklyngerne afrundet til nærmeste ti personer. På samme måde er antallet for regionerne og landsplan også afrundet\ntil nærmeste ti personer. Enkelte kommuner indgår i to forskellige sundhedsklynger. På grund af dette, samt pga. afrunding til ti nærmeste personer vil summen af klyngerne ikke stemme overens summen for hele landet."]
[]
[]
[]
[]
[{"$f":"HYPERLINK(\"#'Tabel 1'!A1\",(Forside!A12 &\":\"&\"  \"& Forside!B12))","v":"Tabel 1:  Antal børn og unge med psykiatriske diagnoser, 2013-2023"}]
["Tabel 1 viser antal børn og unge med psykiatriske diagnoser i den enkelte sundhedsklynge og på landsplan i perioden 2013-2023 opgjort pr. 1. januar i året. Der er tale om børn og unge, der har fået registreret psykiatriske diagnoser på enten psykiatrisk eller somatisk sygehus inden for 10 forudgående år.  "]
[]
[]
[{"$f":"IF(Forside!A13=\"\",\"\",HYPERLINK(\"#'Tabel 2'!A1\",(Forside!A13&\":\"&\"  \"&Forside!B13)))","v":"Tabel 2:  Antal børn og unge med psykiatriske diagnoser pr. 1.000 0-17-årige, 2013-2023"}]
["Tabel 2 viser antal børn og unge med psykiatriske diagnoser pr. 1.000 0-17-årige i sundhedsklyngen."]
[]
[]
[{"$f":"IF(Forside!A14=\"\",\"\",HYPERLINK(\"#T'abel 3'!A1\",(Forside!A14&\":\"&\"  \"&Forside!B14)))","v":"Tabel 3:  Antal børn og unge med udvalgte diagnoser, 2013 og 2023"}]
["Tabel 3 viser antal børn og unge med de fem mest hyppige psykiatriske på landsplan i 2013 og 2023. De fem hyppigste diagnoser er ADHD, autismespektrumforstyrrelser, tilpasnings- og belastningsreaktioner (stress), specifikke udviklingsforstyrrelser og angst (inkl. OCD). Der vises antal i den enkelte sundhedsklynge og på landsplan."]
[]
[]
[{"$f":"IF(Forside!A15=\"\",\"\",HYPERLINK(\"#'Tabel 4'!A1\",(Forside!A15&\":\"&\"  \"&Forside!B15)))","v":"Tabel 4:  Antal børn og unge med udvalgte diagnoser pr. 1.000 0-17-årige, 2013 og 2023"}]
["Tabel 4 viser antal børn og unge med de fem mest hyppige psykiatriske diagnoser på landsplan i 2013 og 2023 opgjort i forhold til 1.000 0-17-årige."]
[]
[]
[{"$f":"IF(Forside!A16=\"\",\"\",HYPERLINK(\"#'Tabel 5'!A1\",(Forside!A16&\":\"&\"  \"&Forside!B16)))","v":"Tabel 5:  Antal børn og unge med mere end en psykiatrisk diagnose, 2013 og 2023"}]
["Tabel 5 viser antal børn og unge der har mere end én registreret psykiatrisk diagnose inden for 10 forudgående år. Tabellen viser faktisk antal og antallet opgjort pr. 1.000 0-17-årige i sundhedsklyngen og på landsplan."]
[]
[]
[{"$f":"IF(Forside!A17=\"\",\"\",HYPERLINK(\"#'Tabel 6'!A1\",(Forside!A17&\":\"&\"  \"&Forside!B17)))","v":"Tabel 6:  Antal børn og unge i kontakt med det psykiatriske sygehusvæsen ved fysisk fremmøde, 2012-2022"}]
["Tabel 6 viser antal børn og unge i kontakt med det psykiatriske sygehusvæsen ved fysisk fremmøde på sygehuset i perioden 2012-2022."]
[]
[]
[{"$f":"IF(Forside!A18=\"\",\"\",HYPERLINK(\"#'Tabel 7'!A1\",(Forside!A18&\":\"&\"  \"&Forside!B18)))","v":"Tabel 7:  Antal børn og unge i kontakt med det psykiatriske sygehusvæsen ved fysisk fremmøde pr. 1.000 0-17-årige, 2012-2022"}]
["Tabel 7 viser antal børn og unge i kontakt med det psykiatriske sygehusvæsen ved fysisk fremmøde på sygehuset i perioden 2012-2022 opgjort pr. 1.000 0-17-årige."]
[]
[]
[{"$f":"IF(Forside!A19=\"\",\"\",HYPERLINK(\"#'Tabel 8'!A1\",(Forside!A19&\":\"&\"  \"&Forside!B19)))","v":"Tabel 8:  Antal børn og unge i virtuel kontakt med det psykiatriske sygehusvæsen, 2012-2022"}]
["Tabel 8 viser antal børn og unge i virtuel kontakt med det psykiatriske sygehusvæsen i perioden 2012-2022. Virtuelle kontakter er defineret som telefon- og videokonsultationer."]
[]
[]
[{"$f":"IF(Forside!A20=\"\",\"\",HYPERLINK(\"#'Tabel 9'!A1\",(Forside!A20&\":\"&\"  \"&Forside!B20)))","v":"Tabel 9:  Antal børn og unge i virtuel kontakt med det psykiatriske sygehusvæsen pr. 1.000 0-17-årige, 2012-2022"}]
["Tabel 9 viser antal børn og unge i virtuel kontakt med det psykiatriske sygehusvæsen i perioden 2012-2022 opgjort pr. 1.000 0-17-årige."]
[]
[]
[{"$f":"IF(Forside!A21=\"\",\"\",HYPERLINK(\"#'Tabel 10'!A1\",(Forside!A21&\":\"&\"  \"&Forside!B21)))","v":"Tabel 10:  Antal børn og unge i kontakt med det psykiatriske sygehusvæsen ved et udekontakt, 2012-2022"}]
["Tabel 10 viser antal børn og unge i kontakt med det psykiatriske sygehusvæsen ved et udekontakt i perioden 2012-2022. Udekontakter er defineret som et hjemmebesøg eller udebesøg, som fx skolebesøg."]
[]
[]
[{"$f":"IF(Forside!A22=\"\",\"\",HYPERLINK(\"#'Tabel 11'!A1\",(Forside!A22&\":\"&\"  \"&Forside!B22)))","v":"Tabel 11:  Antal børn og unge i kontakt med det psykiatriske sygehusvæsen ved et udekontakt pr. 1.000 0-17-årige, 2012-2022"}]
["Tabel 11 antal børn og unge i kontakt med det psykiatriske sygehusvæsen ved et udekontakt i perioden 2012-2022 opgjort pr. 1.000 0-17-årige."]
[]
[]
[{"$f":"IF(Forside!A23=\"\",\"\",HYPERLINK(\"#'Tabel 12'!A1\",(Forside!A23&\":\"&\"  \"&Forside!B23)))","v":"Tabel 12:  Antal børn og unge i kontakt med det psykiatriske sygehusvæsen ved enten fysisk fremmøde, virtuel kontakt eller udekontakt 2012-2022"}]
["Tabel 12 viser antal børn og unge i kontakt med det psykiatriske sygehusvæsen ved enten fysisk fremmøde på sygehuset, virtuel kontakt, eller udekontakt i perioden 2012-2022."]
[]
[]
[{"$f":"IF(Forside!A24=\"\",\"\",HYPERLINK(\"#'Tabel 13'!A1\",(Forside!A24&\":\"&\"  \"&Forside!B24)))","v":"Tabel 13:  Antal børn og unge i kontakt med det psykiatriske sygehusvæsen ved enten fysisk fremmøde, virtuel kontakt eller udekontakt pr. 1.000 0-17-årige, 2012-2022"}]
["Tabel 13 viser antal børn og unge i kontakt med det psykiatriske sygehusvæsen ved enten fysisk fremmøde på sygehuset, virtuel kontakt, eller udekontakt i perioden 2012-2022 opgjort pr. 1.000 0-17-årige."]
[]
[]
[{"$f":"IF(Forside!A25=\"\",\"\",HYPERLINK(\"#'Tabel 14'!A1\",(Forside!A25&\":\"&\"  \"&Forside!B25)))","v":"Tabel 14:  Antal debuterende børn og unge i psykiatrien, 2012-2022"}]
["I tabel 14 ses antal børn og unge der er debuterende i psykiatrien. Debuterende er defineret som børn og unge med første psykiatriske kontakt. Opgørelsen er baseret på kontakter med fysisk fremmøde på sygehuset."]
[]
[]
[{"$f":"IF(Forside!A26=\"\",\"\",HYPERLINK(\"#'Tabel 15'!A1\",(Forside!A26&\":\"&\"  \"&Forside!B26)))","v":"Tabel 15:  Antal debuterende børn og unge i psykiatrien pr. 1.000 0-17-årige, 2012-2022"}]
["I tabel 15 ses antal børn og unge der er debuterende i psykiatrien opgjort pr. 1.000 0-17-årige."]
[]
[]
[{"$f":"IF(Forside!A27=\"\",\"\",HYPERLINK(\"#'Tabel 16'!A1\",(Forside!A27&\":\"&\"  \"&Forside!B27)))","v":"Tabel 16:  Antal børn og unge, der er gengangere i psykiatrien, 2012-2022"}]
["I tabel 16 ses antal børn og unge der er gengangere i psykiatrien. Gengangere er defineret som børn og unge, der også på et tidligere tidspunkt har haft en eller flere psykiatriske kontakter. Opgørelsen er baseret på kontakter med fysisk fremmøde på sygehuset."]
[]
[]
[{"$f":"IF(Forside!A28=\"\",\"\",HYPERLINK(\"#'Tabel 17'!A1\",(Forside!A28&\":\"&\"  \"&Forside!B28)))","v":"Tabel 17:  Antal børn og unge, der er gengangere i psykiatrien pr. 1.000 0-17-årige, 2012-2022"}]
["I tabel 17 ses antal børn og unge der er gengangere i psykiatrien opgjort pr. 1.000 0-17-årige."]
[]
[]
[{"$f":"IF(Forside!A29=\"\",\"\",HYPERLINK(\"#'Tabel 18'!A1\",(Forside!A29&\":\"&\"  \"&Forside!B29)))","v":"Tabel 18:  Andel børn og unge med debut i psykiatrien, fordelt efter måden den første kontakt starter på og henvisningsaktør, 2020-2022"}]
["Tabel 18 viser andel børn og unge med debut i psykiatrien, fordelt efter måden den første kontakt starter på, som enten kan være akut eller planlagt på tværs af sundhedsklynger samt kommuner inden for sundhedsklyngen. For at sikre robuste opgørelser er andele opgjort på baggrund af perioden 2020-2022."]
[]
[]
[{"$f":"IF(Forside!A30=\"\",\"\",HYPERLINK(\"#'Tabel 19'!A1\",(Forside!A30&\":\"&\"  \"&Forside!B30)))","v":"Tabel 19:  Andel børn og unge med debut fordelt efter henvisningsaktør i sundhedsklynge og kommune, 2020-2022"}]
["Tabel 19 viser andel børn og unge med debut i psykiatrien, fordelt efter henvisningsaktør, som er enten aktører i sundhedsklyngen (herunder psykologer i Pædagogisk Psykologisk \nRådgivning (PPR), sagsbehandlere i socialforvaltningen og sundhedsplejen), læger i praksissektoren (primært almen praktiserende læger og i mindre grad speciallæger) samt andre sygehusafdelinger (herunder akutordningen). Andele er opgjort på tværs af sundhedsklynger samt kommuner inden for sundhedsklyngen. For at sikre robuste opgørelser er andele opgjort på baggrund af perioden 2020-2022."]

{"sheet":"Tabel 1","index":2,"n_rows":33,"n_cols":12,"rows_kept":33,"cut":false,"hidden":false,"merged":[[7,0,7,11]]}
[]
[{"$f":"Forside!A12","v":"Tabel 1"},{"$f":"Forside!B12","v":"Antal børn og unge med psykiatriske diagnoser, 2013-2023"}]
[]
["Forsiden"]
[]
[]
[]
["Antal børn og unge med psykiatriske diagnoser, 2013-2023"]
[]
[null,2013,2014,2015,2016,2017,2018,2019,2020,2021,2022,2023]
["Bornholm (Hovedstaden)",500,490,470,450,440,430,430,410,390,430,460]
["Fynsklyngen (Syddanmark)",5600,5830,6170,6610,6630,6570,6530,6450,6370,6330,6240]
["Gødstrup-klyngen (Midtjylland)",2660,2850,2990,3140,3330,3520,3660,3830,3970,4140,4180]
["Horsensklyngen (Midtjylland)",1940,2050,2180,2350,2470,2570,2660,2850,2930,3040,3010]
["Klynge Byen (Hovedstaden)",3080,3200,3210,3300,3330,3360,3330,3520,3490,3670,3890]
["Klynge Midt (Hovedstaden)",4370,4460,4680,4900,5100,5160,5180,5490,5650,5940,6200]
["Klynge Midt (Nordjylland)",1320,1470,1610,1630,1750,1940,2020,2250,2260,2410,2560]
["Klynge Nord (Hovedstaden)",3320,3410,3580,3710,3860,4010,4030,4150,4210,4460,4790]
["Klynge Nord (Nordjylland)",1130,1180,1250,1310,1380,1520,1580,1680,1620,1640,1810]
["Klynge Syd (Hovedstaden)",5250,5310,5430,5730,5870,5900,5990,6240,6270,6530,6830]
["Klynge Syd (Nordjylland)",710,760,820,830,910,990,1090,1150,1150,1170,1230]
["Klynge Vest (Nordjylland)",490,490,520,490,510,530,550,570,580,600,620]
["Klyngen Holbæk (Sjælland)",2300,2370,2500,2580,2730,2840,2900,2970,3050,3140,3120]
["Klyngen Nykøbing F (Sjælland)",1420,1460,1570,1640,1650,1620,1540,1510,1510,1500,1510]
["Klyngen Næstved/Slagelse (Sjælland)",2460,2560,2700,2890,3040,3180,3150,3290,3320,3470,3460]
["Klyngen Roskilde/Køge (Sjælland)",2900,3000,3150,3320,3450,3490,3530,3550,3620,3720,3630]
["Lillebæltsklyngen (Syddanmark)",3900,4000,4190,4380,4480,4660,4810,4790,4800,4850,4860]
["Midtklyngen (Midtjylland)",2200,2340,2490,2630,2680,2730,2780,2850,2960,3110,3130]
["Randersklyngen (Midtjylland)",2310,2470,2700,2820,3000,3130,3190,3350,3450,3530,3450]
["Sydvestjysk klynge (Syddanmark)",2500,2520,2690,2800,2930,3160,3290,3180,3270,3380,3520]
["Sønderjysk klynge (Syddanmark)",3080,3170,3360,3500,3530,3610,3580,3530,3410,3440,3360]
["Århusklyngen (Midtjylland)",2290,2450,2650,2760,2840,2940,2970,3080,3200,3430,3440]
["Landsplan",54130,56180,59180,61920,64030,65930,66780,68670,69400,71850,73220]

{"sheet":"Tabel 2","index":3,"n_rows":33,"n_cols":12,"rows_kept":33,"cut":false,"hidden":false,"merged":[[7,0,7,11]]}
[]
[{"$f":"Forside!A13","v":"Tabel 2"},{"$f":"Forside!B13","v":"Antal børn og unge med psykiatriske diagnoser pr. 1.000 0-17-årige, 2013-2023"}]
[]
["Forsiden"]
[]
[]
[]
["Antal børn og unge med psykiatriske diagnoser pr. 1.000 0-17-årige, 2013-2023"]
[]
[null,2013,2014,2015,2016,2017,2018,2019,2020,2021,2022,2023]
["Bornholm (Hovedstaden)",67,67.900000000000006,67.099999999999994,65.8,65,64.400000000000006,64.7,61.8,59,65,69.8]
["Fynsklyngen (Syddanmark)",55.6,58.8,63.1,67.900000000000006,68.3,68.3,68.400000000000006,68.099999999999994,67.5,67.2,66.2]
["Gødstrup-klyngen (Midtjylland)",41.1,44.7,47.6,50.6,53.9,57.3,60.3,63.8,67,70.599999999999994,70.900000000000006]
["Horsensklyngen (Midtjylland)",38.700000000000003,41.3,44.1,47.3,49.4,51.4,53.1,56.8,58.1,59.6,58.3]
["Klynge Byen (Hovedstaden)",40.200000000000003,41.3,40.9,41.7,41.6,41.8,41.3,43.9,43.8,47,50.1]
["Klynge Midt (Hovedstaden)",43,43.9,45.9,48,50,50.5,50.7,53.6,54.9,57.5,59.7]
["Klynge Midt (Nordjylland)",27.7,31.2,34.4,34.9,37.299999999999997,41.3,43.1,48,48.1,50.9,53.8]
["Klynge Nord (Hovedstaden)",46.9,49.2,52.3,54.6,57.3,59.8,60.7,63.3,64.3,68.3,73.400000000000006]
["Klynge Nord (Nordjylland)",33.299999999999997,35.6,38.1,40.299999999999997,43,48,50.4,54.2,53.1,54.4,59.9]
["Klynge Syd (Hovedstaden)",48.1,48.2,48.6,50.7,51.1,50.5,50.6,51.9,51.7,53.2,55]
["Klynge Syd (Nordjylland)",28.9,31.6,34.5,35.700000000000003,39.1,43.1,47.7,50.9,51.6,52.5,55]
["Klynge Vest (Nordjylland)",34.9,36.6,39.299999999999997,37.799999999999997,40.1,42.2,43.3,45.7,47.2,49.8,51.3]
["Klyngen Holbæk (Sjælland)",60.3,63.4,68,70.5,74.599999999999994,78.599999999999994,81.400000000000006,84.2,87,89.7,88.9]
["Klyngen Nykøbing F (Sjælland)",50.2,53.2,58.5,61.6,62.8,62.4,60.6,60.9,62,62.3,63.3]
["Klyngen Næstved/Slagelse (Sjælland)",51.8,54.8,58.7,63.1,66.7,69.900000000000006,70,74,75.099999999999994,78.599999999999994,78.400000000000006]
["Klyngen Roskilde/Køge (Sjælland)",48,50.4,53.4,56.2,58.3,59,59.8,60.2,61.2,62.6,60.9]
["Lillebæltsklyngen (Syddanmark)",48.2,49.9,52.9,55.4,56.7,59.2,61.6,61.7,62.1,62.6,62.5]
["Midtklyngen (Midtjylland)",41.3,44.6,48.1,50.9,52.1,53.5,54.7,56.4,58.7,61.7,62]
["Randersklyngen (Midtjylland)",46.6,50.6,56.3,59.2,63.4,66.5,68.5,72.7,74.900000000000006,76.3,74.3]
["Sydvestjysk klynge (Syddanmark)",47.8,49.1,53.1,55.8,58.7,63.9,67.3,65.599999999999994,68,71,73.7]
["Sønderjysk klynge (Syddanmark)",63,66.2,71.5,75.599999999999994,76.8,79.8,80.5,80.5,79.3,80.599999999999994,78.7]
["Århusklyngen (Midtjylland)",36.799999999999997,39.4,42.5,43.9,44.8,46.1,46.3,47.7,49.4,53.1,52.9]
["Landsplan",45.5,47.7,50.6,53,54.8,56.6,57.6,59.4,60.2,62.4,63.3]

{"sheet":"Tabel 3","index":4,"n_rows":34,"n_cols":11,"rows_kept":34,"cut":false,"hidden":false,"merged":[[7,0,7,10],[10,1,10,5],[10,6,10,10]]}
[]
[{"$f":"Forside!A14","v":"Tabel 3"},{"$f":"Forside!B14","v":"Antal børn og unge med udvalgte diagnoser, 2013 og 2023"}]
[]
["Forsiden"]
[]
[]
[]
["Antal børn og unge med udvalgte psykiatriske diagnoser, 2013 og 2023"]
[]
[null,"ADHD","Autisme","Stress","Udvikl.f.","Angst","ADHD","Autisme","Stress","Udvikl.f.","Angst"]
[null,2013,null,null,null,null,2023]
["Bornholm (Hovedstaden)",210,180,40,50,70,200,140,50,50,110]
["Fynsklyngen (Syddanmark)",730,460,1490,1220,670,550,720,1630,1660,980]
["Gødstrupklyngen (Midtjylland)",800,540,290,560,250,2060,1320,720,930,420]
["Horsensklyngen (Midtjylland)",700,460,280,490,200,1410,1040,520,700,370]
["Klynge Byen (Hovedstaden)",760,970,460,490,310,1050,1630,620,260,490]
["Klynge Midt (Hovedstaden)",1260,1170,650,450,520,2360,2370,980,590,950]
["Klynge Midt (Nordjylland)",330,310,240,270,120,1350,820,640,460,240]
["Klynge Nord (Hovedstaden)",1170,680,490,510,450,1840,1890,960,560,810]
["Klynge Nord (Nordjylland)",300,200,180,210,80,970,500,430,360,140]
["Klynge Syd (Hovedstaden)",1340,1330,880,670,600,2360,2690,1060,650,930]
["Klynge Syd (Nordjylland)",180,180,130,130,50,660,340,300,240,100]
["Klynge Vest (Nordjylland)",150,90,80,100,40,290,190,140,110,50]
["Klyngen Holbæk (Sjælland)",930,510,280,190,220,1270,1280,620,290,350]
["Klyngen Nykøbing F. (Sjælland)",350,260,230,120,130,390,420,380,180,210]
["Klyngen Næstved/Slagelse (Sjælland)",700,440,410,180,290,1380,1400,750,420,440]
["Klyngen Roskilde/Køge (Sjælland)",900,740,430,190,320,1130,1610,830,310,520]
["Lillebæltklyngen (Syddanmark)",980,710,660,500,380,1580,1100,780,700,600]
["Midtklyngen (Midtjylland)",810,380,350,450,200,1470,920,640,770,360]
["Randersklyngen (Midtjylland)",770,500,340,650,250,1660,1100,530,930,380]
["Sydvestjysk klynge (Syddanmark)",310,250,520,440,320,1100,750,820,390,560]
["Sønderjysk klynge (Syddanmark)",1190,530,440,430,270,1350,700,360,510,320]
["Aarhusklyngen (Midtjylland)",720,570,340,680,290,1460,1260,550,770,470]
["Landsplan",15260,11220,8900,8710,5850,27240,23650,13900,11540,9520]

{"sheet":"Tabel 4","index":5,"n_rows":34,"n_cols":11,"rows_kept":34,"cut":false,"hidden":false,"merged":[[7,0,7,10],[10,1,10,5],[10,6,10,10]]}
[]
[{"$f":"Forside!A15","v":"Tabel 4"},{"$f":"Forside!B15","v":"Antal børn og unge med udvalgte diagnoser pr. 1.000 0-17-årige, 2013 og 2023"}]
[]
["Forsiden"]
[]
[]
[]
["Antal børn og unge med udvalgte psykiatriske diagnoser pr. 1.000 0-17-årige, 2013 og 2023"]
[]
[null,"ADHD","Autisme","Stress","Udvikl.f.","Angst","ADHD","Autisme","Stress","Udvikl.f.","Angst"]
[null,2013,null,null,null,null,2023]
["Bornholm (Hovedstaden)",28.3,23.9,4.8,6,9.8000000000000007,30.4,20.399999999999999,8.1999999999999993,7.6,15.9]
["Fynsklyngen (Syddanmark)",7.2,4.5999999999999996,14.8,12.1,6.6,5.8,7.6,17.3,17.600000000000001,10.4]
["Gødstrupklyngen (Midtjylland)",12.3,8.3000000000000007,4.5,8.6999999999999993,3.8,34.9,22.3,12.3,15.8,7.1]
["Horsensklyngen (Midtjylland)",13.9,9.1999999999999993,5.5,9.9,4.0999999999999996,27.2,20.100000000000001,10,13.5,7.1]
["Klynge Byen (Hovedstaden)",9.9,12.6,6.1,6.4,4,13.5,21,8,3.4,6.3]
["Klynge Midt (Hovedstaden)",12.4,11.5,6.4,4.5,5.0999999999999996,22.7,22.8,9.4,5.7,9.1]
["Klynge Midt (Nordjylland)",6.8,6.6,5,5.6,2.4,28.3,17.2,13.4,9.6,5.0999999999999996]
["Klynge Nord (Hovedstaden)",16.600000000000001,9.6,7,7.1,6.3,28.2,28.9,14.7,8.5,12.5]
["Klynge Nord (Nordjylland)",8.6999999999999993,5.8,5.3,6.1,2.2999999999999998,32.1,16.600000000000001,14.3,11.8,4.8]
["Klynge Syd (Hovedstaden)",12.3,12.2,8,6.1,5.5,19,21.7,8.6,5.3,7.5]
["Klynge Syd (Nordjylland)",7.2,7.4,5.5,5.5,2,29.4,15.1,13.4,10.7,4.4000000000000004]
["Klynge Vest (Nordjylland)",10.7,6.1,5.8,7,2.7,23.8,15.3,11.1,9.4,4]
["Klyngen Holbæk (Sjælland)",24.4,13.5,7.4,4.9000000000000004,5.9,36.299999999999997,36.5,17.7,8.4,10.1]
["Klyngen Nykøbing F. (Sjælland)",12.3,9.1,8.1999999999999993,4.3,4.7,16.3,17.7,15.8,7.4,8.6]
["Klyngen Næstved/Slagelse (Sjælland)",14.6,9.1999999999999993,8.6999999999999993,3.7,6.1,31.3,31.6,16.899999999999999,9.5,9.9]
["Klyngen Roskilde/Køge (Sjælland)",14.9,12.3,7.2,3.2,5.3,19,26.9,13.9,5.2,8.6999999999999993]
["Lillebæltklyngen (Syddanmark)",12.1,8.8000000000000007,8.1,6.1,4.7,20.3,14.2,10,8.9,7.7]
["Midtklyngen (Midtjylland)",15.3,7.1,6.5,8.5,3.8,29.1,18.2,12.6,15.2,7.2]
["Randersklyngen (Midtjylland)",15.6,10,6.9,13.1,5,35.799999999999997,23.7,11.3,20.100000000000001,8.1]
["Sydvestjysk klynge (Syddanmark)",6,4.7,10,8.4,6.1,23.1,15.7,17.2,8.1999999999999993,11.8]
["Sønderjysk klynge (Syddanmark)",24.2,10.9,9.1,8.8000000000000007,5.5,31.7,16.5,8.5,12,7.6]
["Aarhusklyngen (Midtjylland)",11.5,9.1,5.4,10.9,4.7,22.5,19.399999999999999,8.4,11.9,7.2]
["Landsplan",12.8,9.4,7.5,7.3,4.9000000000000004,23.6,20.5,12,10,8.1999999999999993]

{"sheet":"Tabel 5","index":6,"n_rows":33,"n_cols":5,"rows_kept":33,"cut":false,"hidden":false,"merged":[]}
[]
[{"$f":"Forside!A16","v":"Tabel 5"},{"$f":"Forside!B16","v":"Antal børn og unge med mere end en psykiatrisk diagnose, 2013 og 2023"}]
[]
["Forsiden"]
[]
[]
[]
["Antal børn og unge med mere end én psykiatrisk diagnose, 2013 og 2023"]
[]
[null,"Antal i 2013","Antal i 2023","Pr. 1.000 i 2013","Pr. 1000 i 2023"]
["Bornholm (Hovedstaden)",210,200,27.9,29.5]
["Fynsklyngen (Syddanmark)",1310,1540,13,16.399999999999999]
["Gødstrupklyngen (Midtjylland)",870,1890,13.4,32.1]
["Horsensklyngen (Midtjylland)",790,1410,15.7,27.4]
["Klynge Byen (Hovedstaden)",1020,1330,13.2,17.100000000000001]
["Klynge Midt (Hovedstaden)",1380,2570,13.6,24.7]
["Klynge Midt (Nordjylland)",490,1220,10.199999999999999,25.6]
["Klynge Nord (Hovedstaden)",1200,2160,16.899999999999999,33.1]
["Klynge Nord (Nordjylland)",340,840,10,28]
["Klynge Syd (Hovedstaden)",1720,2690,15.7,21.7]
["Klynge Syd (Nordjylland)",260,560,10.8,25.1]
["Klynge Vest (Nordjylland)",170,270,11.9,22]
["Klyngen Holbæk (Sjælland)",790,1440,20.6,41.2]
["Klyngen Nykøbing F. (Sjælland)",390,580,13.6,24.3]
["Klyngen Næstved/Slagelse (Sjælland)",670,1620,14.1,36.6]
["Klyngen Roskilde/Køge (Sjælland)",840,1500,13.9,25.1]
["Lillebæltklyngen (Syddanmark)",960,1460,11.9,18.8]
["Midtklyngen (Midtjylland)",750,1440,14,28.4]
["Randersklyngen (Midtjylland)",900,1580,18.100000000000001,34.1]
["Sydvestjysk klynge (Syddanmark)",600,1120,11.4,23.5]
["Sønderjysk klynge (Syddanmark)",910,930,18.600000000000001,21.8]
["Aarhusklyngen (Midtjylland)",950,1570,15.3,24.1]
["Landsplan",17100,29180,14.4,25.2]

{"sheet":"Tabel 6","index":7,"n_rows":33,"n_cols":12,"rows_kept":33,"cut":false,"hidden":false,"merged":[]}
[]
[{"$f":"Forside!A17","v":"Tabel 6"},{"$f":"Forside!B17","v":"Antal børn og unge i kontakt med det psykiatriske sygehusvæsen ved fysisk fremmøde, 2012-2022"}]
[]
["Forsiden"]
[]
[]
[]
["Antal børn og unge i kontakt med det psykiatriske sygehusvæsen ved fysisk fremmøde, 2012-2022"]
[]
[null,2012,2013,2014,2015,2016,2017,2018,2019,2020,2021,2022]
["Bornholm (Hovedstaden)",340,310,310,280,290,290,280,250,260,300,350]
["Fynsklyngen (Syddanmark)",2680,2640,2810,2820,2760,2760,2750,2530,2440,2580,2600]
["Gødstrup-klyngen (Midtjylland)",1430,1630,1980,2000,1800,1950,2050,2090,2100,2380,2450]
["Horsensklyngen (Midtjylland)",1030,1150,1430,1560,1390,1460,1580,1630,1640,1750,1700]
["Klynge Byen (Hovedstaden)",1530,1550,1600,1670,1600,1760,1860,1890,1950,2120,2380]
["Klynge Midt (Hovedstaden)",2350,2350,2570,2780,2870,2930,2940,3100,3250,3530,3820]
["Klynge Midt (Nordjylland)",690,810,920,950,1120,1350,1320,1350,1320,1610,1760]
["Klynge Nord (Hovedstaden)",1810,1830,1990,2160,2230,2390,2390,2460,2570,2770,3170]
["Klynge Nord (Nordjylland)",500,570,660,710,820,980,970,990,870,1030,1180]
["Klynge Syd (Hovedstaden)",2650,2590,2880,3070,3170,3220,3280,3420,3480,3660,4130]
["Klynge Syd (Nordjylland)",350,410,460,500,570,680,710,740,670,760,840]
["Klynge Vest (Nordjylland)",260,290,300,330,360,380,350,350,320,360,420]
["Klyngen Holbæk (Sjælland)",1400,1440,1550,1630,1650,1660,1600,1590,1610,1790,1780]
["Klyngen Nykøbing F (Sjælland)",760,800,890,940,900,820,720,720,690,740,770]
["Klyngen Næstved/Slagelse (Sjælland)",1330,1400,1600,1710,1740,1710,1720,1770,1740,1930,1960]
["Klyngen Roskilde/Køge (Sjælland)",1700,1670,1880,1990,2020,2020,2000,1970,1900,2070,2130]
["Lillebæltsklyngen (Syddanmark)",2250,2220,2400,2420,2530,2600,2830,2860,2740,2890,2840]
["Midtklyngen (Midtjylland)",1230,1480,1720,1770,1530,1530,1560,1660,1650,1750,1810]
["Randersklyngen (Midtjylland)",1170,1440,1710,1800,1710,1790,1860,1870,1800,2000,2040]
["Sydvestjysk klynge (Syddanmark)",1330,1370,1560,1580,1760,2010,2030,2000,1980,2240,2300]
["Sønderjysk klynge (Syddanmark)",2040,1970,2070,2040,2080,2150,2170,2070,2010,2160,2260]
["Århusklyngen (Midtjylland)",1240,1540,1780,1780,1560,1720,1690,1670,1810,2010,2050]
["Landsplan",29220,30620,34150,35550,35440,37100,37560,37810,37660,41250,43530]

{"sheet":"Tabel 7","index":8,"n_rows":33,"n_cols":12,"rows_kept":33,"cut":false,"hidden":false,"merged":[]}
[]
[{"$f":"Forside!A18","v":"Tabel 7"},{"$f":"Forside!B18","v":"Antal børn og unge i kontakt med det psykiatriske sygehusvæsen ved fysisk fremmøde pr. 1.000 0-17-årige, 2012-2022"}]
[]
["Forsiden"]
[]
[]
[]
["Antal børn og unge i kontakt med det psykiatriske sygehusvæsen ved fysisk fremmøde pr. 1.000 0-17-årige, 2012-2022"]
[]
[null,2012,2013,2014,2015,2016,2017,2018,2019,2020,2021,2022]
["Bornholm (Hovedstaden)",44,41.2,43.7,39.6,42.5,42.7,41.3,38.299999999999997,39.5,44.8,52.5]
["Fynsklyngen (Syddanmark)",26.2,26.2,28.3,28.9,28.3,28.4,28.6,26.5,25.8,27.3,27.7]
["Gødstrup-klyngen (Midtjylland)",21.7,25.2,31.1,31.9,29,31.6,33.5,34.299999999999997,35,40.1,41.7]
["Horsensklyngen (Midtjylland)",20.399999999999999,22.9,28.8,31.5,28.1,29.2,31.6,32.6,32.700000000000003,34.6,33.4]
["Klynge Byen (Hovedstaden)",20.399999999999999,20.2,20.7,21.4,20.3,22,23.1,23.4,24.3,26.7,30.6]
["Klynge Midt (Hovedstaden)",23.2,23.2,25.3,27.3,28.2,28.7,28.8,30.4,31.7,34.299999999999997,36.9]
["Klynge Midt (Nordjylland)",14.4,17,19.399999999999999,20.3,24,28.8,28,28.7,28,34.200000000000003,37.200000000000003]
["Klynge Nord (Hovedstaden)",25.2,25.9,28.6,31.5,32.799999999999997,35.5,35.700000000000003,37.1,39.200000000000003,42.3,48.5]
["Klynge Nord (Nordjylland)",14.3,16.8,19.8,21.8,25.2,30.6,30.6,31.5,28,33.6,38.9]
["Klynge Syd (Hovedstaden)",24.5,23.7,26.1,27.5,28,28,28.1,28.9,28.9,30.2,33.700000000000003]
["Klynge Syd (Nordjylland)",14.1,16.899999999999999,19.2,21.3,24.5,29.3,31,32.4,29.5,34,37.700000000000003]
["Klynge Vest (Nordjylland)",18.399999999999999,20.5,22.4,24.9,27.4,29.8,27.7,28,25.8,29.2,34.299999999999997]
["Klyngen Holbæk (Sjælland)",35.799999999999997,37.799999999999997,41.6,44.4,45,45.5,44.4,44.7,45.6,51.2,50.7]
["Klyngen Nykøbing F (Sjælland)",26,28.2,32.6,35.1,33.799999999999997,31.1,27.7,28.2,27.7,30.3,32.1]
["Klyngen Næstved/Slagelse (Sjælland)",27.5,29.5,34.299999999999997,37.200000000000003,37.799999999999997,37.6,37.799999999999997,39.299999999999997,39.200000000000003,43.6,44.3]
["Klyngen Roskilde/Køge (Sjælland)",27.7,27.7,31.6,33.700000000000003,34.200000000000003,34,33.9,33.4,32.299999999999997,35.1,35.799999999999997]
["Lillebæltsklyngen (Syddanmark)",27.5,27.4,30,30.5,32.1,32.9,36,36.6,35.299999999999997,37.299999999999997,36.700000000000003]
["Midtklyngen (Midtjylland)",22.8,27.8,32.700000000000003,34.1,29.7,29.7,30.5,32.6,32.700000000000003,34.700000000000003,36]
["Randersklyngen (Midtjylland)",23.3,29.1,35.200000000000003,37.6,35.9,37.700000000000003,39.5,40.1,39.1,43.4,44.1]
["Sydvestjysk klynge (Syddanmark)",25.1,26.2,30.4,31.2,35.1,40.299999999999997,41.2,40.799999999999997,40.799999999999997,46.7,48.2]
["Sønderjysk klynge (Syddanmark)",40.6,40.299999999999997,43.3,43.3,45,46.8,47.9,46.4,45.9,50.3,53]
["Århusklyngen (Midtjylland)",19.8,24.7,28.7,28.5,24.8,27.1,26.5,26.1,28,31,31.8]
["Landsplan",24.3,25.7,29,30.4,30.4,31.8,32.200000000000003,32.6,32.6,35.799999999999997,37.799999999999997]

{"sheet":"Tabel 8","index":9,"n_rows":33,"n_cols":12,"rows_kept":33,"cut":false,"hidden":false,"merged":[]}
[]
[{"$f":"Forside!A19","v":"Tabel 8"},{"$f":"Forside!B19","v":"Antal børn og unge i virtuel kontakt med det psykiatriske sygehusvæsen, 2012-2022"}]
[]
["Forsiden"]
[]
[]
[]
["Antal børn og unge i virtuel kontakt med det psykiatriske sygehusvæsen, 2012-2022"]
[]
[null,2012,2013,2014,2015,2016,2017,2018,2019,2020,2021,2022]
["Bornholm (Hovedstaden)",210,190,160,190,170,160,130,100,170,220,230]
["Fynsklyngen (Syddanmark)",920,830,850,800,700,810,960,1000,1380,1470,1520]
["Gødstrup-klyngen (Midtjylland)",820,880,930,870,870,1020,1160,1100,1350,1410,1560]
["Horsensklyngen (Midtjylland)",600,660,760,730,690,750,780,850,1110,1080,1060]
["Klynge Byen (Hovedstaden)",700,700,760,780,750,730,900,780,1230,1370,1460]
["Klynge Midt (Hovedstaden)",1180,1100,1260,1280,1290,1290,1450,1370,2140,2470,2500]
["Klynge Midt (Nordjylland)",80,90,80,100,120,160,180,900,1010,1180,1170]
["Klynge Nord (Hovedstaden)",970,920,1090,980,950,1030,1170,1160,1710,1960,2010]
["Klynge Nord (Nordjylland)",60,50,70,80,90,100,130,620,680,730,760]
["Klynge Syd (Hovedstaden)",1260,1210,1420,1490,1490,1450,1570,1560,2300,2530,2660]
["Klynge Syd (Nordjylland)",40,50,60,50,50,90,100,450,520,550,560]
["Klynge Vest (Nordjylland)",30,40,40,40,40,50,40,210,240,280,270]
["Klyngen Holbæk (Sjælland)",570,530,500,640,660,730,800,680,1160,1380,1440]
["Klyngen Nykøbing F (Sjælland)",240,230,260,240,260,230,350,350,520,570,580]
["Klyngen Næstved/Slagelse (Sjælland)",440,480,530,610,670,730,930,840,1330,1460,1560]
["Klyngen Roskilde/Køge (Sjælland)",590,640,780,910,880,1020,1140,960,1500,1640,1730]
["Lillebæltsklyngen (Syddanmark)",1320,1080,970,1020,1080,1130,1170,1280,1840,1770,1770]
["Midtklyngen (Midtjylland)",690,830,920,830,770,800,890,1000,1150,1130,1130]
["Randersklyngen (Midtjylland)",660,820,890,810,810,910,920,990,1190,1220,1250]
["Sydvestjysk klynge (Syddanmark)",790,630,660,720,840,900,900,1020,1390,1530,1600]
["Sønderjysk klynge (Syddanmark)",1010,1040,950,940,1080,1100,1110,1170,1490,1420,1360]
["Århusklyngen (Midtjylland)",730,850,890,790,750,790,800,830,1170,1180,1220]
["Landsplan",13440,13520,14460,14510,14580,15530,17130,18660,25810,27730,28560]

{"sheet":"Tabel 9","index":10,"n_rows":33,"n_cols":12,"rows_kept":33,"cut":false,"hidden":false,"merged":[]}
[]
[{"$f":"Forside!A20","v":"Tabel 9"},{"$f":"Forside!B20","v":"Antal børn og unge i virtuel kontakt med det psykiatriske sygehusvæsen pr. 1.000 0-17-årige, 2012-2022"}]
[]
["Forsiden"]
[]
[]
[]
["Antal børn og unge i virtuel kontakt med det psykiatriske sygehusvæsen pr. 1.000 0-17-årige, 2012-2022"]
[]
[null,2012,2013,2014,2015,2016,2017,2018,2019,2020,2021,2022]
["Bornholm (Hovedstaden)",27,24.9,21.8,26.6,25.3,23.7,19.399999999999999,15,25.3,32.4,35.200000000000003]
["Fynsklyngen (Syddanmark)",9,8.1999999999999993,8.6,8.1999999999999993,7.1,8.4,10,10.5,14.6,15.5,16.2]
["Gødstrup-klyngen (Midtjylland)",12.4,13.6,14.6,13.9,14,16.5,19,18.100000000000001,22.5,23.8,26.6]
["Horsensklyngen (Midtjylland)",11.8,13.2,15.4,14.7,13.9,15,15.6,16.899999999999999,22.1,21.4,20.7]
["Klynge Byen (Hovedstaden)",9.3000000000000007,9.1999999999999993,9.9,9.9,9.5,9.1,11.1,9.6999999999999993,15.3,17.2,18.7]
["Klynge Midt (Hovedstaden)",11.6,10.8,12.4,12.6,12.7,12.6,14.2,13.4,20.8,24,24.2]
["Klynge Midt (Nordjylland)",1.6,1.8,1.7,2.2000000000000002,2.6,3.3,3.9,19.2,21.6,25.1,24.6]
["Klynge Nord (Hovedstaden)",13.4,13,15.7,14.4,14,15.3,17.5,17.5,26.1,29.9,30.9]
["Klynge Nord (Nordjylland)",1.7,1.5,2.2000000000000002,2.4,2.8,3,4.2,19.7,21.7,23.9,25]
["Klynge Syd (Hovedstaden)",11.7,11.1,12.9,13.3,13.2,12.6,13.4,13.1,19.100000000000001,20.8,21.6]
["Klynge Syd (Nordjylland)",1.7,2,2.2999999999999998,2.2999999999999998,2.2999999999999998,3.7,4.5,19.8,23.2,24.8,25]
["Klynge Vest (Nordjylland)",2.2000000000000002,2.6,2.7,3,3.2,4.2,3,17,19.3,22.5,22.6]
["Klyngen Holbæk (Sjælland)",14.6,14,13.3,17.399999999999999,18,20.100000000000001,22.2,19.100000000000001,32.799999999999997,39.299999999999997,41.1]
["Klyngen Nykøbing F (Sjælland)",8.1,8.1999999999999993,9.6,9,9.9,8.8000000000000007,13.3,13.8,20.9,23.3,23.9]
["Klyngen Næstved/Slagelse (Sjælland)",9.1,10.199999999999999,11.3,13.2,14.6,16,20.5,18.7,29.9,32.9,35.200000000000003]
["Klyngen Roskilde/Køge (Sjælland)",9.5,10.7,13.2,15.4,14.9,17.2,19.2,16.3,25.4,27.7,29]
["Lillebæltsklyngen (Syddanmark)",16.100000000000001,13.4,12.1,12.8,13.7,14.4,14.9,16.399999999999999,23.7,22.8,22.9]
["Midtklyngen (Midtjylland)",12.8,15.6,17.5,16.100000000000001,15,15.6,17.399999999999999,19.7,22.8,22.4,22.4]
["Randersklyngen (Midtjylland)",13.1,16.600000000000001,18.2,16.8,17.100000000000001,19.3,19.600000000000001,21.2,25.8,26.5,27.1]
["Sydvestjysk klynge (Syddanmark)",14.8,12,12.9,14.3,16.8,17.899999999999999,18.2,20.8,28.8,31.8,33.6]
["Sønderjysk klynge (Syddanmark)",20.100000000000001,21.2,19.7,19.899999999999999,23.4,23.9,24.6,26.3,34,33,32]
["Århusklyngen (Midtjylland)",11.7,13.7,14.3,12.7,11.9,12.4,12.5,12.9,18.2,18.2,18.899999999999999]
["Landsplan",11.2,11.4,12.3,12.4,12.5,13.3,14.7,16.100000000000001,22.3,24.1,24.8]

{"sheet":"Tabel 10","index":11,"n_rows":33,"n_cols":12,"rows_kept":33,"cut":false,"hidden":false,"merged":[]}
[]
[{"$f":"Forside!A21","v":"Tabel 10"},{"$f":"Forside!B21","v":"Antal børn og unge i kontakt med det psykiatriske sygehusvæsen ved et udekontakt, 2012-2022"}]
[]
["Forsiden"]
[]
[]
[]
["Antal børn og unge i kontakt med det psykiatriske sygehusvæsen ved et udekontakt, 2012-2022"]
[]
[null,2012,2013,2014,2015,2016,2017,2018,2019,2020,2021,2022]
["Bornholm (Hovedstaden)",30,20,20,20,20,20,20,20,20,10,20]
["Fynsklyngen (Syddanmark)",350,300,320,280,300,300,300,280,220,230,260]
["Gødstrup-klyngen (Midtjylland)",90,220,230,300,310,390,330,270,240,200,250]
["Horsensklyngen (Midtjylland)",100,170,190,200,210,230,230,240,170,130,130]
["Klynge Byen (Hovedstaden)",210,230,270,270,270,250,290,260,200,230,320]
["Klynge Midt (Hovedstaden)",250,280,360,380,370,270,290,240,300,310,410]
["Klynge Midt (Nordjylland)",40,30,50,30,50,40,30,30,30,50,40]
["Klynge Nord (Hovedstaden)",140,190,250,230,260,220,230,190,240,260,380]
["Klynge Nord (Nordjylland)",20,30,20,10,20,20,20,20,20,30,20]
["Klynge Syd (Hovedstaden)",350,340,390,450,440,370,430,380,370,350,530]
["Klynge Syd (Nordjylland)",10,10,20,20,20,20,10,20,20,20,20]
["Klynge Vest (Nordjylland)",10,10,10,10,10,10,10,10,10,10,10]
["Klyngen Holbæk (Sjælland)",30,30,40,30,30,30,40,90,100,90,80]
["Klyngen Nykøbing F (Sjælland)",40,70,50,30,40,30,30,40,40,30,30]
["Klyngen Næstved/Slagelse (Sjælland)",40,70,60,40,40,40,50,100,90,80,70]
["Klyngen Roskilde/Køge (Sjælland)",110,100,100,60,50,50,80,200,190,180,200]
["Lillebæltsklyngen (Syddanmark)",350,320,360,340,360,420,470,460,460,350,310]
["Midtklyngen (Midtjylland)",90,190,220,230,190,210,200,220,160,80,160]
["Randersklyngen (Midtjylland)",160,280,230,240,270,310,260,290,180,160,180]
["Sydvestjysk klynge (Syddanmark)",140,160,180,180,200,230,220,240,310,290,300]
["Sønderjysk klynge (Syddanmark)",440,430,390,390,380,410,430,340,350,280,160]
["Århusklyngen (Midtjylland)",190,310,320,270,290,270,270,270,210,220,240]
["Landsplan",3070,3680,3910,3900,4010,4020,4080,4040,3770,3470,3980]

{"sheet":"Tabel 11","index":12,"n_rows":33,"n_cols":12,"rows_kept":33,"cut":false,"hidden":false,"merged":[]}
[]
[{"$f":"Forside!A22","v":"Tabel 11"},{"$f":"Forside!B22","v":"Antal børn og unge i kontakt med det psykiatriske sygehusvæsen ved et udekontakt pr. 1.000 0-17-årige, 2012-2022"}]
[]
["Forsiden"]
[]
[]
[]
["Antal børn og unge i kontakt med det psykiatriske sygehusvæsen ved et udekontakt, pr. 1.000 0-17-årige, 2012-2022"]
[]
[null,2012,2013,2014,2015,2016,2017,2018,2019,2020,2021,2022]
["Bornholm (Hovedstaden)",3.8,2.4,2.5,2.4,2.9,2.8,2.4,2.2999999999999998,2.2999999999999998,0.8,2.2999999999999998]
["Fynsklyngen (Syddanmark)",3.4,3,3.2,2.9,3,3.1,3.1,3,2.4,2.4,2.7]
["Gødstrup-klyngen (Midtjylland)",1.4,3.4,3.6,4.8,5,6.3,5.4,4.4000000000000004,3.9,3.4,4.2]
["Horsensklyngen (Midtjylland)",2,3.4,3.8,4.0999999999999996,4.3,4.5999999999999996,4.5999999999999996,4.8,3.3,2.6,2.5]
["Klynge Byen (Hovedstaden)",2.8,3,3.4,3.5,3.4,3.2,3.5,3.2,2.5,2.9,4.0999999999999996]
["Klynge Midt (Hovedstaden)",2.4,2.7,3.5,3.7,3.7,2.7,2.8,2.2999999999999998,2.9,3,4]
["Klynge Midt (Nordjylland)",0.8,0.6,1.1000000000000001,0.6,1,0.7,0.7,0.7,0.7,1,0.9]
["Klynge Nord (Hovedstaden)",2,2.7,3.7,3.3,3.8,3.2,3.5,2.8,3.7,3.9,5.8]
["Klynge Nord (Nordjylland)",0.7,0.7,0.5,0.4,0.5,0.7,0.6,0.6,0.6,1,0.6]
["Klynge Syd (Hovedstaden)",3.2,3.1,3.6,4,3.9,3.2,3.7,3.2,3.1,2.9,4.4000000000000004]
["Klynge Syd (Nordjylland)",0.5,0.6,0.8,0.6,0.7,0.6,0.6,0.8,0.9,0.8,1]
["Klynge Vest (Nordjylland)",0.7,0.5,0.5,1.1000000000000001,1.1000000000000001,0.5,0.5,0.6,0.7,1.1000000000000001,0.5]
["Klyngen Holbæk (Sjælland)",0.8,0.9,1,0.8,0.8,0.8,1.1000000000000001,2.6,2.8,2.6,2.4]
["Klyngen Nykøbing F (Sjælland)",1.3,2.4,1.9,1.2,1.4,1.1000000000000001,1,1.7,1.7,1.1000000000000001,1.4]
["Klyngen Næstved/Slagelse (Sjælland)",0.8,1.4,1.2,0.8,1,0.9,1,2.2000000000000002,2,1.9,1.5]
["Klyngen Roskilde/Køge (Sjælland)",1.8,1.7,1.7,1.1000000000000001,0.9,0.9,1.3,3.3,3.2,3.1,3.4]
["Lillebæltsklyngen (Syddanmark)",4.3,3.9,4.5,4.3,4.5999999999999996,5.4,5.9,5.8,5.9,4.5,3.9]
["Midtklyngen (Midtjylland)",1.6,3.5,4.0999999999999996,4.4000000000000004,3.7,4.0999999999999996,4,4.3,3.1,1.7,3.2]
["Randersklyngen (Midtjylland)",3.1,5.7,4.5999999999999996,5,5.8,6.4,5.5,6.2,3.9,3.5,3.9]
["Sydvestjysk klynge (Syddanmark)",2.7,3,3.5,3.5,4,4.5999999999999996,4.4000000000000004,4.8,6.4,6,6.3]
["Sønderjysk klynge (Syddanmark)",8.8000000000000007,8.8000000000000007,8,8.4,8.3000000000000007,9,9.5,7.7,8.1,6.6,3.6]
["Århusklyngen (Midtjylland)",3.1,5,5.0999999999999996,4.3,4.5,4.3,4.2,4.0999999999999996,3.2,3.4,3.7]
["Landsplan",2.6,3.1,3.3,3.3,3.4,3.4,3.5,3.5,3.3,3,3.5]

{"sheet":"Tabel 12","index":13,"n_rows":33,"n_cols":12,"rows_kept":33,"cut":false,"hidden":false,"merged":[]}
[]
[{"$f":"Forside!A23","v":"Tabel 12"},{"$f":"Forside!B23","v":"Antal børn og unge i kontakt med det psykiatriske sygehusvæsen ved enten fysisk fremmøde, virtuel kontakt eller udekontakt 2012-2022"}]
[]
["Forsiden"]
[]
[]
[]
["Antal børn og unge i kontakt med det psykiatriske sygehusvæsen ved enten fysisk fremmøde, virtuel kontakt eller udekontakt, 2012-2022"]
[]
[null,2012,2013,2014,2015,2016,2017,2018,2019,2020,2021,2022]
["Bornholm (Hovedstaden)",350,320,320,290,290,290,280,260,270,310,360]
["Fynsklyngen (Syddanmark)",2740,2710,2880,2900,2840,2830,2830,2640,2600,2780,2830]
["Gødstrup-klyngen (Midtjylland)",1470,1670,2020,2050,1830,2000,2110,2130,2190,2470,2610]
["Horsensklyngen (Midtjylland)",1050,1190,1450,1580,1430,1490,1610,1660,1740,1830,1830]
["Klynge Byen (Hovedstaden)",1570,1590,1650,1720,1650,1800,1900,1940,2030,2230,2490]
["Klynge Midt (Hovedstaden)",2380,2380,2620,2830,2920,2980,3000,3170,3370,3710,4000]
["Klynge Midt (Nordjylland)",690,820,920,950,1130,1360,1330,1360,1370,1660,1810]
["Klynge Nord (Hovedstaden)",1860,1860,2030,2190,2250,2410,2420,2510,2690,2920,3290]
["Klynge Nord (Nordjylland)",500,570,660,710,820,980,970,990,910,1050,1210]
["Klynge Syd (Hovedstaden)",2690,2620,2950,3130,3230,3290,3360,3510,3620,3870,4280]
["Klynge Syd (Nordjylland)",350,420,460,510,580,690,720,750,710,800,880]
["Klynge Vest (Nordjylland)",260,290,300,330,360,390,350,360,330,370,440]
["Klyngen Holbæk (Sjælland)",1420,1450,1570,1650,1670,1680,1610,1620,1670,1860,1880]
["Klyngen Nykøbing F (Sjælland)",760,800,900,960,900,830,730,730,740,780,820]
["Klyngen Næstved/Slagelse (Sjælland)",1340,1410,1620,1730,1750,1750,1730,1800,1830,2010,2070]
["Klyngen Roskilde/Køge (Sjælland)",1710,1680,1900,2010,2030,2050,2020,2010,2010,2150,2220]
["Lillebæltsklyngen (Syddanmark)",2290,2270,2440,2460,2580,2640,2860,2900,2900,3040,2970]
["Midtklyngen (Midtjylland)",1250,1500,1760,1800,1560,1550,1590,1690,1750,1830,1920]
["Randersklyngen (Midtjylland)",1210,1490,1750,1840,1740,1810,1890,1900,1910,2100,2170]
["Sydvestjysk klynge (Syddanmark)",1360,1400,1590,1610,1790,2050,2070,2030,2100,2350,2420]
["Sønderjysk klynge (Syddanmark)",2100,2030,2120,2090,2120,2190,2220,2120,2130,2280,2330]
["Århusklyngen (Midtjylland)",1280,1580,1830,1810,1590,1750,1720,1720,1890,2100,2200]
["Landsplan",29760,31200,34800,36170,36020,37730,38170,38610,39580,43290,45760]

{"sheet":"Tabel 13","index":14,"n_rows":33,"n_cols":12,"rows_kept":33,"cut":false,"hidden":false,"merged":[]}
[]
[{"$f":"Forside!A24","v":"Tabel 13"},{"$f":"Forside!B24","v":"Antal børn og unge i kontakt med det psykiatriske sygehusvæsen ved enten fysisk fremmøde, virtuel kontakt eller udekontakt pr. 1.000 0-17-årige, 2012-2022"}]
[]
["Forsiden"]
[]
[]
[]
["Antal børn og unge i kontakt med det psykiatriske sygehusvæsen ved enten fysisk fremmøde, virtuel kontakt eller udekontakt pr. 1.000 0-17-årige, 2012-2022"]
[]
[null,2012,2013,2014,2015,2016,2017,2018,2019,2020,2021,2022]
["Bornholm (Hovedstaden)",45.2,42.4,44.4,41.2,42.6,42.9,41.9,38.9,40.1,47,53.7]
["Fynsklyngen (Syddanmark)",26.8,26.9,29.1,29.6,29.2,29.2,29.4,27.6,27.4,29.5,30]
["Gødstrup-klyngen (Midtjylland)",22.2,25.8,31.7,32.6,29.5,32.4,34.299999999999997,35,36.6,41.7,44.5]
["Horsensklyngen (Midtjylland)",20.8,23.8,29.3,32,28.8,29.7,32.1,33.299999999999997,34.6,36.299999999999997,35.9]
["Klynge Byen (Hovedstaden)",20.8,20.7,21.3,22,20.8,22.5,23.7,24.1,25.3,28.1,31.9]
["Klynge Midt (Hovedstaden)",23.5,23.4,25.8,27.8,28.6,29.2,29.3,31,32.9,36.1,38.700000000000003]
["Klynge Midt (Nordjylland)",14.4,17.100000000000001,19.399999999999999,20.3,24.1,28.9,28.2,29,29.1,35.299999999999997,38.299999999999997]
["Klynge Nord (Hovedstaden)",25.8,26.3,29.3,32,33.1,35.799999999999997,36.1,37.799999999999997,40.9,44.7,50.4]
["Klynge Nord (Nordjylland)",14.4,16.8,19.899999999999999,21.9,25.3,30.7,30.7,31.7,29.4,34.5,39.9]
["Klynge Syd (Hovedstaden)",24.9,24,26.8,28,28.6,28.6,28.8,29.6,30.1,31.9,34.9]
["Klynge Syd (Nordjylland)",14.1,17.100000000000001,19.3,21.3,24.7,29.5,31.2,32.6,31.3,35.700000000000003,39.700000000000003]
["Klynge Vest (Nordjylland)",18.399999999999999,20.6,22.5,25,27.5,30,27.8,28.1,26.7,30.5,35.9]
["Klyngen Holbæk (Sjælland)",36.1,37.9,41.9,44.9,45.5,46,44.7,45.4,47.5,52.9,53.7]
["Klyngen Nykøbing F (Sjælland)",26.2,28.3,33,35.799999999999997,34.1,31.3,28.2,28.6,29.7,32,34.1]
["Klyngen Næstved/Slagelse (Sjælland)",27.7,29.7,34.700000000000003,37.5,38.1,38.299999999999997,38.1,40,41.1,45.5,46.7]
["Klyngen Roskilde/Køge (Sjælland)",27.9,27.8,32,34.1,34.4,34.6,34.1,34.1,34.1,36.299999999999997,37.299999999999997]
["Lillebæltsklyngen (Syddanmark)",28.1,28.1,30.4,31,32.6,33.5,36.299999999999997,37.200000000000003,37.4,39.200000000000003,38.299999999999997]
["Midtklyngen (Midtjylland)",23.1,28.2,33.5,34.799999999999997,30.2,30.1,31,33.299999999999997,34.6,36.4,38.200000000000003]
["Randersklyngen (Midtjylland)",24.1,30.1,35.9,38.299999999999997,36.6,38.299999999999997,40.1,40.9,41.5,45.6,47.1]
["Sydvestjysk klynge (Syddanmark)",25.5,26.7,31,31.7,35.700000000000003,41,41.8,41.5,43.4,48.9,50.8]
["Sønderjysk klynge (Syddanmark)",41.8,41.5,44.2,44.3,45.9,47.8,49,47.6,48.6,53,54.6]
["Århusklyngen (Midtjylland)",20.5,25.5,29.4,29,25.3,27.6,27,26.8,29.3,32.299999999999997,34]
["Landsplan",24.7,26.2,29.6,30.9,30.9,32.299999999999997,32.799999999999997,33.299999999999997,34.200000000000003,37.5,39.700000000000003]

{"sheet":"Tabel 14","index":15,"n_rows":33,"n_cols":12,"rows_kept":33,"cut":false,"hidden":false,"merged":[]}
[]
[{"$f":"Forside!A25","v":"Tabel 14"},{"$f":"Forside!B25","v":"Antal debuterende børn og unge i psykiatrien, 2012-2022"}]
[]
["Forsiden"]
[]
[]
[]
["Antal debuterende børn og unge i psykiatrien, 2012-2022"]
[]
[null,2012,2013,2014,2015,2016,2017,2018,2019,2020,2021,2022]
["Bornholm (Hovedstaden)",100,70,90,80,90,90,90,70,80,130,140]
["Fynsklyngen (Syddanmark)",1150,1200,1310,1270,1210,1180,1140,1060,1060,1180,1100]
["Gødstrup-klyngen (Midtjylland)",610,780,920,910,730,780,770,740,760,880,810]
["Horsensklyngen (Midtjylland)",400,470,610,630,510,560,600,580,570,610,510]
["Klynge Byen (Hovedstaden)",550,570,590,640,570,740,640,740,790,870,930]
["Klynge Midt (Hovedstaden)",920,860,980,1010,1060,1080,950,1070,1190,1290,1360]
["Klynge Midt (Nordjylland)",370,410,440,440,500,590,530,510,450,610,590]
["Klynge Nord (Hovedstaden)",660,630,720,770,820,860,730,790,890,990,1090]
["Klynge Nord (Nordjylland)",260,290,310,320,350,440,350,350,300,380,420]
["Klynge Syd (Hovedstaden)",990,900,1100,1170,1160,1200,1090,1160,1260,1350,1550]
["Klynge Syd (Nordjylland)",170,210,230,250,260,300,280,280,240,290,320]
["Klynge Vest (Nordjylland)",110,130,130,140,150,160,130,120,110,130,170]
["Klyngen Holbæk (Sjælland)",440,400,460,520,490,500,520,490,520,550,500]
["Klyngen Nykøbing F (Sjælland)",270,290,340,350,310,280,240,250,250,290,330]
["Klyngen Næstved/Slagelse (Sjælland)",490,530,600,640,620,580,560,590,580,670,660]
["Klyngen Roskilde/Køge (Sjælland)",630,610,700,690,640,660,690,610,670,770,730]
["Lillebæltsklyngen (Syddanmark)",880,840,950,920,920,970,1030,970,940,990,920]
["Midtklyngen (Midtjylland)",460,630,710,730,520,500,520,570,580,630,620]
["Randersklyngen (Midtjylland)",480,600,730,740,620,630,630,650,570,690,650]
["Sydvestjysk klynge (Syddanmark)",590,600,730,660,740,870,770,690,720,830,760]
["Sønderjysk klynge (Syddanmark)",660,580,730,650,670,690,620,580,590,710,680]
["Århusklyngen (Midtjylland)",530,710,810,730,560,670,610,610,660,780,690]
["Landsplan",11330,11960,13770,13860,13080,13860,13080,13060,13380,15240,15130]

{"sheet":"Tabel 15","index":16,"n_rows":33,"n_cols":12,"rows_kept":33,"cut":false,"hidden":false,"merged":[]}
[]
[{"$f":"Forside!A26","v":"Tabel 15"},{"$f":"Forside!B26","v":"Antal debuterende børn og unge i psykiatrien pr. 1.000 0-17-årige, 2012-2022"}]
[]
["Forsiden"]
[]
[]
[]
["Antal debuterende børn og unge i psykiatrien pr. 1.000 0-17-årige, 2012-2022"]
[]
[null,2012,2013,2014,2015,2016,2017,2018,2019,2020,2021,2022]
["Bornholm (Hovedstaden)",12.9,8.9,12.5,11.8,13.5,13.6,13.7,11,12.1,20.2,21.6]
["Fynsklyngen (Syddanmark)",11.2,11.9,13.2,13,12.4,12.2,11.8,11.1,11.2,12.5,11.7]
["Gødstrup-klyngen (Midtjylland)",9.3000000000000007,12.1,14.4,14.5,11.8,12.7,12.5,12.2,12.6,14.8,13.9]
["Horsensklyngen (Midtjylland)",7.9,9.4,12.3,12.8,10.3,11.1,12.1,11.6,11.3,12.1,10.1]
["Klynge Byen (Hovedstaden)",7.3,7.5,7.6,8.1999999999999993,7.2,9.1999999999999993,8,9.1999999999999993,9.9,11,12]
["Klynge Midt (Hovedstaden)",9,8.4,9.6,9.9,10.4,10.5,9.3000000000000007,10.4,11.6,12.6,13.1]
["Klynge Midt (Nordjylland)",7.7,8.6,9.4,9.4,10.6,12.5,11.3,10.8,9.6999999999999993,13,12.5]
["Klynge Nord (Hovedstaden)",9.1,8.8000000000000007,10.4,11.2,12,12.8,11,11.8,13.6,15.2,16.600000000000001]
["Klynge Nord (Nordjylland)",7.4,8.5,9.4,9.6999999999999993,10.9,13.9,11.1,11.3,9.6999999999999993,12.5,13.8]
["Klynge Syd (Hovedstaden)",9.1999999999999993,8.3000000000000007,10,10.5,10.3,10.4,9.4,9.8000000000000007,10.5,11.1,12.7]
["Klynge Syd (Nordjylland)",6.7,8.6,9.5,10.4,11.2,12.7,12.3,12,10.8,13.1,14.4]
["Klynge Vest (Nordjylland)",7.8,9.5,9.3000000000000007,10.4,11.6,12.2,10.5,9.8000000000000007,8.5,10.4,13.6]
["Klyngen Holbæk (Sjælland)",11.3,10.6,12.4,14.2,13.3,13.6,14.4,13.7,14.8,15.8,14.4]
["Klyngen Nykøbing F (Sjælland)",9.4,10.199999999999999,12.6,13,11.6,10.6,9.3000000000000007,9.8000000000000007,10,11.8,13.5]
["Klyngen Næstved/Slagelse (Sjælland)",10.199999999999999,11.1,12.9,13.8,13.5,12.6,12.3,13.2,12.9,15.1,14.8]
["Klyngen Roskilde/Køge (Sjælland)",10.3,10.1,11.8,11.7,10.8,11.2,11.7,10.4,11.4,13,12.3]
["Lillebæltsklyngen (Syddanmark)",10.8,10.4,11.8,11.6,11.6,12.3,13,12.4,12.1,12.7,11.8]
["Midtklyngen (Midtjylland)",8.5,11.8,13.6,14.1,10.1,9.6,10.199999999999999,11.2,11.4,12.4,12.4]
["Randersklyngen (Midtjylland)",9.5,12.2,14.9,15.4,13.1,13.3,13.4,13.9,12.3,15.1,14.1]
["Sydvestjysk klynge (Syddanmark)",11.1,11.4,14.1,13.1,14.8,17.399999999999999,15.6,14,14.8,17.3,16]
["Sønderjysk klynge (Syddanmark)",13.2,11.8,15.3,13.9,14.6,15,13.7,13,13.6,16.600000000000001,16]
["Århusklyngen (Midtjylland)",8.5,11.4,13,11.7,8.9,10.5,9.5,9.5,10.3,12,10.6]
["Landsplan",9.4,10,11.7,11.8,11.2,11.9,11.2,11.3,11.6,13.2,13.1]

{"sheet":"Tabel 16","index":17,"n_rows":33,"n_cols":12,"rows_kept":33,"cut":false,"hidden":false,"merged":[]}
[]
[{"$f":"Forside!A27","v":"Tabel 16"},{"$f":"Forside!B27","v":"Antal børn og unge, der er gengangere i psykiatrien, 2012-2022"}]
[]
["Forsiden"]
[]
[]
[]
["Antal børn og unge der er gengangere i psykiatrien, 2012-2022"]
[]
[null,2012,2013,2014,2015,2016,2017,2018,2019,2020,2021,2022]
["Bornholm (Hovedstaden)",240,240,220,190,200,200,180,180,180,160,200]
["Fynsklyngen (Syddanmark)",1530,1440,1500,1550,1550,1570,1610,1470,1380,1400,1500]
["Gødstrup-klyngen (Midtjylland)",820,850,1070,1100,1070,1170,1290,1350,1340,1500,1640]
["Horsensklyngen (Midtjylland)",630,680,820,920,880,910,980,1050,1080,1130,1190]
["Klynge Byen (Hovedstaden)",990,970,1020,1030,1040,1020,1220,1150,1160,1250,1450]
["Klynge Midt (Hovedstaden)",1440,1500,1590,1770,1820,1850,1990,2040,2070,2240,2460]
["Klynge Midt (Nordjylland)",320,400,470,510,630,770,790,840,860,1000,1160]
["Klynge Nord (Hovedstaden)",1160,1210,1270,1390,1410,1540,1660,1680,1680,1780,2080]
["Klynge Nord (Nordjylland)",240,280,340,400,460,540,620,630,570,640,760]
["Klynge Syd (Hovedstaden)",1660,1690,1780,1900,2010,2030,2190,2260,2210,2310,2570]
["Klynge Syd (Nordjylland)",180,200,230,260,310,390,430,470,420,470,520]
["Klynge Vest (Nordjylland)",150,150,180,190,210,230,220,230,220,230,250]
["Klyngen Holbæk (Sjælland)",960,1040,1090,1110,1170,1170,1080,1110,1090,1240,1270]
["Klyngen Nykøbing F (Sjælland)",480,510,550,590,590,540,480,470,440,450,450]
["Klyngen Næstved/Slagelse (Sjælland)",840,880,1000,1080,1120,1140,1160,1180,1170,1260,1300]
["Klyngen Roskilde/Køge (Sjælland)",1070,1060,1180,1300,1380,1350,1310,1360,1230,1310,1400]
["Lillebæltsklyngen (Syddanmark)",1370,1380,1450,1500,1620,1630,1800,1890,1800,1900,1920]
["Midtklyngen (Midtjylland)",770,850,1010,1040,1010,1030,1030,1090,1080,1120,1190]
["Randersklyngen (Midtjylland)",700,840,990,1060,1080,1160,1230,1220,1240,1310,1390]
["Sydvestjysk klynge (Syddanmark)",750,770,840,920,1020,1140,1270,1310,1260,1410,1540]
["Sønderjysk klynge (Syddanmark)",1380,1390,1340,1390,1410,1460,1550,1490,1420,1450,1580]
["Århusklyngen (Midtjylland)",710,820,970,1050,1000,1060,1080,1060,1140,1230,1370]
["Landsplan",17920,18680,20400,21710,22370,23250,24480,24760,24290,26020,28400]

{"sheet":"Tabel 17","index":18,"n_rows":33,"n_cols":12,"rows_kept":33,"cut":false,"hidden":false,"merged":[]}
[]
[{"$f":"Forside!A28","v":"Tabel 17"},{"$f":"Forside!B28","v":"Antal børn og unge, der er gengangere i psykiatrien pr. 1.000 0-17-årige, 2012-2022"}]
[]
["Forsiden"]
[]
[]
[]
["Antal børn og unge der er gengangere i psykiatrien pr. 1.000 0-17-årige, 2012-2022"]
[]
[null,2012,2013,2014,2015,2016,2017,2018,2019,2020,2021,2022]
["Bornholm (Hovedstaden)",31.2,32.299999999999997,31.2,27.9,28.9,29.1,27.6,27.2,27.4,24.7,30.8]
["Fynsklyngen (Syddanmark)",14.9,14.3,15.2,15.8,15.9,16.2,16.7,15.4,14.5,14.8,16]
["Gødstrup-klyngen (Midtjylland)",12.4,13.2,16.7,17.5,17.2,18.899999999999999,21,22.2,22.4,25.3,27.9]
["Horsensklyngen (Midtjylland)",12.5,13.5,16.600000000000001,18.7,17.8,18.2,19.5,20.9,21.5,22.4,23.3]
["Klynge Byen (Hovedstaden)",13.1,12.7,13.2,13.2,13.1,12.8,15.1,14.3,14.4,15.7,18.600000000000001]
["Klynge Midt (Hovedstaden)",14.2,14.8,15.7,17.399999999999999,17.8,18.100000000000001,19.5,19.899999999999999,20.2,21.8,23.8]
["Klynge Midt (Nordjylland)",6.7,8.4,10,10.8,13.4,16.3,16.8,17.899999999999999,18.3,21.2,24.6]
["Klynge Nord (Hovedstaden)",16.100000000000001,17.100000000000001,18.3,20.399999999999999,20.8,22.8,24.8,25.3,25.6,27.2,31.9]
["Klynge Nord (Nordjylland)",7,8.3000000000000007,10.4,12.1,14.3,16.8,19.5,20.2,18.399999999999999,21.1,25.1]
["Klynge Syd (Hovedstaden)",15.4,15.4,16.2,17,17.7,17.600000000000001,18.7,19.100000000000001,18.399999999999999,19.100000000000001,21]
["Klynge Syd (Nordjylland)",7.4,8.3000000000000007,9.6999999999999993,10.9,13.3,16.600000000000001,18.7,20.399999999999999,18.7,21,23.2]
["Klynge Vest (Nordjylland)",10.6,11,13.1,14.5,15.8,17.5,17.2,18.2,17.3,18.8,20.7]
["Klyngen Holbæk (Sjælland)",24.6,27.3,29.2,30.3,31.8,31.9,29.9,31,30.8,35.4,36.4]
["Klyngen Nykøbing F (Sjælland)",16.600000000000001,17.899999999999999,20,22.1,22.2,20.5,18.399999999999999,18.399999999999999,17.7,18.5,18.600000000000001]
["Klyngen Næstved/Slagelse (Sjælland)",17.3,18.399999999999999,21.5,23.4,24.3,24.9,25.5,26.1,26.3,28.5,29.5]
["Klyngen Roskilde/Køge (Sjælland)",17.399999999999999,17.600000000000001,19.8,22,23.4,22.8,22.2,23.1,20.9,22.1,23.5]
["Lillebæltsklyngen (Syddanmark)",16.8,17.100000000000001,18.100000000000001,18.899999999999999,20.5,20.6,22.9,24.3,23.2,24.6,24.8]
["Midtklyngen (Midtjylland)",14.3,16,19.100000000000001,20.100000000000001,19.600000000000001,20.100000000000001,20.2,21.4,21.3,22.3,23.6]
["Randersklyngen (Midtjylland)",13.9,17,20.3,22.2,22.8,24.4,26.1,26.2,26.8,28.5,30]
["Sydvestjysk klynge (Syddanmark)",14,14.8,16.3,18.100000000000001,20.3,22.9,25.6,26.8,26,29.4,32.200000000000003]
["Sønderjysk klynge (Syddanmark)",27.4,28.5,28,29.5,30.5,31.7,34.200000000000003,33.4,32.4,33.700000000000003,37]
["Århusklyngen (Midtjylland)",11.3,13.2,15.7,16.899999999999999,15.9,16.600000000000001,17,16.600000000000001,17.7,19,21.2]
["Landsplan",14.9,15.7,17.3,18.600000000000001,19.2,19.899999999999999,21,21.3,21,22.6,24.7]

{"sheet":"Tabel 18","index":19,"n_rows":115,"n_cols":6,"rows_kept":115,"cut":false,"hidden":false,"merged":[[99,0,102,0],[103,0,107,0],[108,0,111,0],[112,0,113,0],[77,0,79,0],[80,0,83,0],[84,0,89,0],[90,0,95,0],[96,0,98,0],[53,0,56,0],[57,0,67,0],[68,0,70,0],[71,0,72,0],[73,0,76,0],[28,0,31,0],[32,0,33,0],[34,0,42,0],[43,0,44,0],[45,0,52,0],[9,1,10,1],[9,5,10,5],[12,0,21,0],[22,0,27,0]]}
[]
[{"$f":"Forside!A29","v":"Tabel 18"},{"$f":"Forside!B29","v":"Andel børn og unge med debut i psykiatrien, fordelt efter måden den første kontakt starter på og henvisningsaktør, 2020-2022"}]
[]
["Forsiden"]
[]
[]
[]
["Andel børn og unge med debut fordelt efter måden kontakten starter på og henvisningsaktør, 2020-2022"]
[]
["Sundhedsklynge"," Kommune ","Akut i ","Planlagt i","  Akut i ","Planlagt i kommunen"]
[null,null,"klyngen"," klyngen","kommunen"]
["Bornholm (Hovedstaden)","Bornholm",10.4,89.6,10.4,89.6]
["Fynsklyngen (Syddanmark)","Assens",14.8,85.2,15.7,84.3]
[null,"Faaborg-Midtfyn",14.8,85.2,16.3,83.7]
[null,"Kerteminde",14.8,85.2,15.1,84.9]
[null,"Langeland",14.8,85.2,16.899999999999999,83.1]
[null,"Middelfart",14.8,85.2,8.9,91.1]
[null,"Nordfyns",14.8,85.2,14.5,85.5]
[null,"Nyborg",14.8,85.2,15.4,84.6]
[null,"Odense",14.8,85.2,15.3,84.7]
[null,"Svendborg",14.8,85.2,14.5,85.5]
[null,"Ærø",14.8,85.2,".","."]
["Gødstrup-klyngen (Midtjylland)","Herning",5.5,94.5,5,95]
[null,"Holstebro",5.5,94.5,5.8,94.2]
[null,"Ikast-Brande",5.5,94.5,5.6,94.4]
[null,"Lemvig",5.5,94.5,5.9,94.1]
[null,"Ringkøbing-Skjern",5.5,94.5,5.9,94.1]
[null,"Struer",5.5,94.5,5.2,94.8]
["Horsensklyngen (Midtjylland)","Hedensted",9.6,90.4,8.5,91.5]
[null,"Horsens",9.6,90.4,11,89]
[null,"Odder",9.6,90.4,7.1,92.9]
[null,"Skanderborg",9.6,90.4,10.1,89.9]
["Klynge Byen (Hovedstaden)","Frederiksberg",17.5,82.5,18.399999999999999,81.599999999999994]
[null,"København",17.5,82.5,17.2,82.8]
["Klynge Midt (Hovedstaden)","Ballerup",16.600000000000001,83.4,16.600000000000001,83.4]
[null,"Egedal",16.600000000000001,83.4,12.2,87.8]
[null,"Furesø",16.600000000000001,83.4,10.4,89.6]
[null,"Gentofte",16.600000000000001,83.4,18.100000000000001,81.900000000000006]
[null,"Gladsaxe",16.600000000000001,83.4,18.7,81.3]
[null,"Herlev",16.600000000000001,83.4,12.8,87.2]
[null,"Lyngby-Taarbæk",16.600000000000001,83.4,19.7,80.3]
[null,"Rudersdal",16.600000000000001,83.4,16.600000000000001,83.4]
[null,"Rødovre",16.600000000000001,83.4,23.9,76.099999999999994]
["Klynge Midt (Nordjylland)","Jammerbugt",13,87,13.3,86.7]
[null,"Aalborg",13,87,12.9,87.1]
["Klynge Nord (Hovedstaden)","Allerød",18,82,11.9,88.1]
[null,"Fredensborg",18,82,19.3,80.7]
[null,"Frederikssund",18,82,17.7,82.3]
[null,"Gribskov",18,82,19.600000000000001,80.400000000000006]
[null,"Halsnæs",18,82,19.899999999999999,80.099999999999994]
[null,"Helsingør",18,82,17.399999999999999,82.6]
[null,"Hillerød",18,82,18.100000000000001,81.900000000000006]
[null,"Hørsholm",18,82,18.2,81.8]
["Klynge Nord (Nordjylland)","Brønderslev",11.6,88.4,9.6,90.4]
[null,"Frederikshavn",11.6,88.4,13.1,86.9]
[null,"Hjørring",11.6,88.4,11.7,88.3]
[null,"Læsø",11.6,88.4,".","."]
["Klynge Syd (Hovedstaden)","Albertslund",20.2,79.8,25.2,74.8]
[null,"Brøndby",20.2,79.8,21.6,78.400000000000006]
[null,"Dragør",20.2,79.8,15.3,84.7]
[null,"Glostrup",20.2,79.8,17.3,82.7]
[null,"Hvidovre",20.2,79.8,23.5,76.5]
[null,"Høje-Taastrup",20.2,79.8,24.4,75.599999999999994]
[null,"Ishøj",20.2,79.8,15.7,84.3]
[null,"København",20.2,79.8,17.5,82.5]
[null,"Rødovre",20.2,79.8,23.9,76.099999999999994]
[null,"Tårnby",20.2,79.8,21.4,78.599999999999994]
[null,"Vallensbæk",20.2,79.8,22.9,77.099999999999994]
["Klynge Syd (Nordjylland)","Mariagerfjord",13.8,86.2,16.2,83.8]
[null,"Rebild",13.8,86.2,8.1,91.9]
[null,"Vesthimmerlands",13.8,86.2,17.7,82.3]
["Klynge Vest (Nordjylland)","Morsø",12.3,87.7,20.5,79.5]
[null,"Thisted",12.3,87.7,8.6999999999999993,91.3]
["Klyngen Holbæk (Sjælland)","Holbæk",24.9,75.099999999999994,25.3,74.7]
[null,"Kalundborg",24.9,75.099999999999994,23.9,76.099999999999994]
[null,"Lejre",24.9,75.099999999999994,25,75]
[null,"Odsherred",24.9,75.099999999999994,25.3,74.7]
["Klyngen Nykøbing F (Sjælland)","Guldborgsund",37.200000000000003,62.8,36.4,63.6]
[null,"Lolland",37.200000000000003,62.8,31.7,68.3]
[null,"Vordingborg",37.200000000000003,62.8,42.5,57.5]
["Klyngen Næstved/Slagelse (Sjælland)","Næstved",24.7,75.3,27.6,72.400000000000006]
[null,"Ringsted",24.7,75.3,28.5,71.5]
[null,"Slagelse",24.7,75.3,20.6,79.400000000000006]
[null,"Sorø",24.7,75.3,24.8,75.2]
["Klyngen Roskilde/Køge (Sjælland)","Faxe",24.6,75.400000000000006,31.5,68.5]
[null,"Greve",24.6,75.400000000000006,20.8,79.2]
[null,"Køge",24.6,75.400000000000006,25.4,74.599999999999994]
[null,"Roskilde",24.6,75.400000000000006,20.399999999999999,79.599999999999994]
[null,"Solrød",24.6,75.400000000000006,23.7,76.3]
[null,"Stevns",24.6,75.400000000000006,37,63]
["Lillebæltsklyngen (Syddanmark)","Billund",6.5,93.5,7.1,92.9]
[null,"Fredericia",6.5,93.5,5.7,94.3]
[null,"Kolding",6.5,93.5,5.7,94.3]
[null,"Middelfart",6.5,93.5,8.9,91.1]
[null,"Vejen",6.5,93.5,6.8,93.2]
[null,"Vejle",6.5,93.5,6.6,93.4]
["Midtklyngen (Midtjylland)","Silkeborg",10.6,89.4,11,89]
[null,"Skive",10.6,89.4,8,92]
[null,"Viborg",10.6,89.4,11.4,88.6]
["Randersklyngen (Midtjylland)","Favrskov",8.1999999999999993,91.8,7.9,92.1]
[null,"Norddjurs",8.1999999999999993,91.8,5.2,94.8]
[null,"Randers",8.1999999999999993,91.8,8.6999999999999993,91.3]
[null,"Syddjurs",8.1999999999999993,91.8,10.9,89.1]
["Sydvestjysk klynge (Syddanmark)","Billund",6.8,93.2,7.1,92.9]
[null,"Esbjerg",6.8,93.2,7.7,92.3]
[null,"Fanø",6.8,93.2,".","."]
[null,"Varde",6.8,93.2,5,95]
[null,"Vejen",6.8,93.2,6.8,93.2]
["Sønderjysk klynge (Syddanmark)","Haderslev",5.7,94.3,7,93]
[null,"Sønderborg",5.7,94.3,5.3,94.7]
[null,"Tønder",5.7,94.3,4.5999999999999996,95.4]
[null,"Aabenraa",5.7,94.3,5.8,94.2]
["Århusklyngen (Midtjylland)","Samsø",9.6,90.4,17.2,82.8]
[null,"Aarhus",9.6,90.4,9.4,90.6]
["Landsplan",null,14.6,85.4,14.6,85.4]

{"sheet":"Tabel 19","index":20,"n_rows":115,"n_cols":8,"rows_kept":115,"cut":false,"hidden":false,"merged":[[103,0,107,0],[108,0,111,0],[112,0,113,0],[80,0,83,0],[84,0,89,0],[90,0,95,0],[96,0,98,0],[99,0,102,0],[68,0,70,0],[71,0,72,0],[73,0,76,0],[77,0,79,0],[53,0,56,0],[57,0,67,0],[28,0,31,0],[32,0,33,0],[34,0,42,0],[43,0,44,0],[45,0,52,0],[9,2,9,4],[9,5,9,7],[12,0,21,0],[22,0,27,0]]}
[]
[{"$f":"Forside!A30","v":"Tabel 19"},{"$f":"Forside!B30","v":"Andel børn og unge med debut fordelt efter henvisningsaktør i sundhedsklynge og kommune, 2020-2022"}]
[]
["Forsiden"]
[]
[]
[]
["Andel børn og unge med debut fordelt efter måden kontakten starter på og henvisningsaktør, 2020-2022"]
[]
["Sundhedsklynge","Kommune","Andel i klyngen",null,null,"Andel i kommunen"]
[null,null,"Kommune","Prakt. Læge","Sygehusafsnit","Kommune","Prakt. Læge","Sygehusafsnit"]
["Bornholm (Hovedstaden)","Bornholm",25.5,59.1,15.4,25.5,59.1,15.4]
["Fynsklyngen (Syddanmark)","Assens",18.399999999999999,56,25.6,10.8,61.9,27.3]
[null,"Faaborg-Midtfyn",18.399999999999999,56,25.6,16.3,58.5,25.1]
[null,"Kerteminde",18.399999999999999,56,25.6,24,51.6,24.5]
[null,"Langeland",18.399999999999999,56,25.6,13.6,57.6,28.8]
[null,"Middelfart",18.399999999999999,56,25.6,22.2,55.6,22.2]
[null,"Nordfyns",18.399999999999999,56,25.6,23.8,51.4,24.8]
[null,"Nyborg",18.399999999999999,56,25.6,19.2,52.9,27.9]
[null,"Odense",18.399999999999999,56,25.6,18.5,55.2,26.3]
[null,"Svendborg",18.399999999999999,56,25.6,18.8,58,23.3]
[null,"Ærø",18.399999999999999,56,25.6,24.1,44.8,31]
["Gødstrup-klyngen (Midtjylland)","Herning",53.6,34.299999999999997,12.1,50.3,36.5,13.2]
[null,"Holstebro",53.6,34.299999999999997,12.1,55.6,33.200000000000003,11.2]
[null,"Ikast-Brande",53.6,34.299999999999997,12.1,66.2,24.9,8.9]
[null,"Lemvig",53.6,34.299999999999997,12.1,49,38.200000000000003,12.7]
[null,"Ringkøbing-Skjern",53.6,34.299999999999997,12.1,39.200000000000003,44.8,16]
[null,"Struer",53.6,34.299999999999997,12.1,61,29,10]
["Horsensklyngen (Midtjylland)","Hedensted",45.1,40.5,14.4,55.9,32.700000000000003,11.4]
[null,"Horsens",45.1,40.5,14.4,39,45.4,15.6]
[null,"Odder",45.1,40.5,14.4,56.7,33.799999999999997,9.5]
[null,"Skanderborg",45.1,40.5,14.4,38.299999999999997,44,17.7]
["Klynge Byen (Hovedstaden)","Frederiksberg",32.5,44.2,23.3,27.4,49.4,23.2]
[null,"København",32.5,44.2,23.3,33.799999999999997,42.9,23.3]
["Klynge Midt (Hovedstaden)","Ballerup",32,44.2,23.8,33.5,42.9,23.7]
[null,"Egedal",32,44.2,23.8,38.4,44.3,17.2]
[null,"Furesø",32,44.2,23.8,34.6,49.2,16.100000000000001]
[null,"Gentofte",32,44.2,23.8,31.1,42.9,25.9]
[null,"Gladsaxe",32,44.2,23.8,33,41.3,25.7]
[null,"Herlev",32,44.2,23.8,34.799999999999997,41,24.2]
[null,"Lyngby-Taarbæk",32,44.2,23.8,25.3,46.4,28.3]
[null,"Rudersdal",32,44.2,23.8,29.3,46.4,24.2]
[null,"Rødovre",32,44.2,23.8,26.8,43.5,29.7]
["Klynge Midt (Nordjylland)","Jammerbugt",28.4,48.2,23.4,29.7,46.2,24.1]
[null,"Aalborg",28.4,48.2,23.4,28,48.7,23.3]
["Klynge Nord (Hovedstaden)","Allerød",32.9,42.8,24.3,33,47.6,19.399999999999999]
[null,"Fredensborg",32.9,42.8,24.3,22.2,49.6,28.2]
[null,"Frederikssund",32.9,42.8,24.3,27.9,47.5,24.7]
[null,"Gribskov",32.9,42.8,24.3,35.1,41.5,23.5]
[null,"Halsnæs",32.9,42.8,24.3,37.700000000000003,37.1,25.1]
[null,"Helsingør",32.9,42.8,24.3,38.799999999999997,36.9,24.3]
[null,"Hillerød",32.9,42.8,24.3,32.1,44,23.8]
[null,"Hørsholm",32.9,42.8,24.3,35.1,40.9,24]
["Klynge Nord (Nordjylland)","Brønderslev",29.4,51.3,19.3,31.5,49.7,18.899999999999999]
[null,"Frederikshavn",29.4,51.3,19.3,27.1,53.5,19.5]
[null,"Hjørring",29.4,51.3,19.3,30,50.4,19.600000000000001]
[null,"Læsø",29.4,51.3,19.3,".",".","."]
["Klynge Syd (Hovedstaden)","Albertslund",34.4,39.700000000000003,25.9,30.1,38.9,31]
[null,"Brøndby",34.4,39.700000000000003,25.9,45,28.6,26.4]
[null,"Dragør",34.4,39.700000000000003,25.9,30.6,48.6,20.7]
[null,"Glostrup",34.4,39.700000000000003,25.9,40.299999999999997,35.700000000000003,24]
[null,"Hvidovre",34.4,39.700000000000003,25.9,27,44.5,28.4]
[null,"Høje-Taastrup",34.4,39.700000000000003,25.9,31.1,39.1,29.9]
[null,"Ishøj",34.4,39.700000000000003,25.9,49.7,29.8,20.399999999999999]
[null,"København",34.4,39.700000000000003,25.9,35.4,40.9,23.7]
[null,"Rødovre",34.4,39.700000000000003,25.9,26.8,43.5,29.7]
[null,"Tårnby",34.4,39.700000000000003,25.9,31.3,42,26.8]
[null,"Vallensbæk",34.4,39.700000000000003,25.9,38.9,33.6,27.5]
["Klynge Syd (Nordjylland)","Mariagerfjord",30.3,46.6,23.1,28.7,49.4,21.9]
[null,"Rebild",30.3,46.6,23.1,32.4,42.7,24.9]
[null,"Vesthimmerlands",30.3,46.6,23.1,29.7,48.1,22.3]
["Klynge Vest (Nordjylland)","Morsø",27.1,45.7,27.1,24.6,46.7,28.7]
[null,"Thisted",27.1,45.7,27.1,28.3,45.3,26.4]
["Klyngen Holbæk (Sjælland)","Holbæk",42.7,28.1,29.2,46.6,25.1,28.2]
[null,"Kalundborg",42.7,28.1,29.2,42.6,29,28.3]
[null,"Lejre",42.7,28.1,29.2,39.200000000000003,30.2,30.6]
[null,"Odsherred",42.7,28.1,29.2,36.1,32,32]
["Klyngen Nykøbing F (Sjælland)","Guldborgsund",27.9,30.4,41.7,22.3,37.9,39.799999999999997]
[null,"Lolland",27.9,30.4,41.7,34.6,28,37.4]
[null,"Vordingborg",27.9,30.4,41.7,28.4,24.4,47.2]
["Klyngen Næstved/Slagelse (Sjælland)","Næstved",44.8,26.2,29,42.2,25.1,32.700000000000003]
[null,"Ringsted",44.8,26.2,29,24.2,37.5,38.299999999999997]
[null,"Slagelse",44.8,26.2,29,57.7,19.2,23.1]
[null,"Sorø",44.8,26.2,29,36.4,37.200000000000003,26.4]
["Klyngen Roskilde/Køge (Sjælland)","Faxe",40.4,30.4,29.2,39.9,24,36]
[null,"Greve",40.4,30.4,29.2,47.7,25,27.3]
[null,"Køge",40.4,30.4,29.2,27.9,43.4,28.6]
[null,"Roskilde",40.4,30.4,29.2,43.3,31.5,25.1]
[null,"Solrød",40.4,30.4,29.2,48.4,24.2,27.4]
[null,"Stevns",40.4,30.4,29.2,34.4,23.4,42.2]
["Lillebæltsklyngen (Syddanmark)","Billund",35,43.3,21.7,43.5,32.9,23.5]
[null,"Fredericia",35,43.3,21.7,40.9,36.299999999999997,22.8]
[null,"Kolding",35,43.3,21.7,40.799999999999997,36.5,22.7]
[null,"Middelfart",35,43.3,21.7,22.2,55.6,22.2]
[null,"Vejen",35,43.3,21.7,19.8,60.9,19.3]
[null,"Vejle",35,43.3,21.7,35.700000000000003,43.5,20.9]
["Midtklyngen (Midtjylland)","Silkeborg",37.700000000000003,44.4,17.899999999999999,38.9,41.2,19.899999999999999]
[null,"Skive",37.700000000000003,44.4,17.899999999999999,47.3,39.1,13.6]
[null,"Viborg",37.700000000000003,44.4,17.899999999999999,31.6,50.7,17.7]
["Randersklyngen (Midtjylland)","Favrskov",49.7,37,13.3,52.2,35.6,12.3]
[null,"Norddjurs",49.7,37,13.3,59.6,30.3,10.1]
[null,"Randers",49.7,37,13.3,45.8,39.9,14.3]
[null,"Syddjurs",49.7,37,13.3,43.5,40.4,16.100000000000001]
["Sydvestjysk klynge (Syddanmark)","Billund",20,58.6,21.4,43.5,32.9,23.5]
[null,"Esbjerg",20,58.6,21.4,17.2,60.5,22.2]
[null,"Fanø",20,58.6,21.4,".",".","."]
[null,"Varde",20,58.6,21.4,15.6,64.400000000000006,20]
[null,"Vejen",20,58.6,21.4,19.8,60.9,19.3]
["Sønderjysk klynge (Syddanmark)","Haderslev",50.4,35.200000000000003,14.4,48.6,36.1,15.3]
[null,"Sønderborg",50.4,35.200000000000003,14.4,53,34.299999999999997,12.7]
[null,"Tønder",50.4,35.200000000000003,14.4,47.9,36.299999999999997,15.8]
[null,"Aabenraa",50.4,35.200000000000003,14.4,50.1,35,15]
["Århusklyngen (Midtjylland)","Samsø",49.1,39.200000000000003,11.8,".",".","."]
[null,"Aarhus",49.1,39.200000000000003,11.8,48.9,39.5,11.6]
["Landsplan",null,36.299999999999997,41.7,22,36.299999999999997,41.7,22]